Raspbian Package Auto-Building

Buildd status for xsimd (bookworm-staging)

Debian PTSTrackerChangelogBugspackages.d.obuildd.d.o

Package(s): Suite:
Compact mode Co-maintainers

ArchitectureVersionStatusForBuilddStateMiscLogs
Buildd exposure stats armhf  7.6.0-2Build-Attempted66d 1h 15mmb-lxc-02uncompiledmisc:sourceold | all (3)

Tail of log for xsimd on armhf:

/<<PKGBUILDDIR>>/test/test_algorithms.cpp:192:63: note: parameter passing for argument of type ‘const __gnu_cxx::__normal_iterator<double*, std::vector<double, xsimd::aligned_allocator<double, 4> > >’ changed in GCC 7.1
  192 |     EXPECT_EQ(std::accumulate(begin, end, init), xsimd::reduce(begin, end, init));
      |                                                  ~~~~~~~~~~~~~^~~~~~~~~~~~~~~~~~
/<<PKGBUILDDIR>>/test/test_algorithms.cpp:199:69: note: parameter passing for argument of type ‘const __gnu_cxx::__normal_iterator<double*, std::vector<double, xsimd::aligned_allocator<double, 4> > >’ changed in GCC 7.1
  199 |         EXPECT_EQ(std::accumulate(sbegin, send, init), xsimd::reduce(sbegin, send, init));
      |                                                        ~~~~~~~~~~~~~^~~~~~~~~~~~~~~~~~~~
make[4]: Leaving directory '/<<PKGBUILDDIR>>/obj-arm-linux-gnueabihf'
make[3]: *** [CMakeFiles/Makefile2:102: test/CMakeFiles/test_xsimd.dir/all] Error 2
make[3]: Leaving directory '/<<PKGBUILDDIR>>/obj-arm-linux-gnueabihf'
make[2]: *** [Makefile:149: all] Error 2
make[2]: Leaving directory '/<<PKGBUILDDIR>>/obj-arm-linux-gnueabihf'
dh_auto_build: error: cd obj-arm-linux-gnueabihf && make -j4 "INSTALL=install --strip-program=true" VERBOSE=1 returned exit code 2
make[1]: *** [debian/rules:19: override_dh_auto_build] Error 25
make[1]: Leaving directory '/<<PKGBUILDDIR>>'
make: *** [debian/rules:9: binary-arch] Error 2