Raspbian Package Auto-Building

Buildd status for wlcs (bookworm-staging)

Debian PTSTrackerChangelogBugspackages.d.obuildd.d.o

Package(s): Suite:
Compact mode Co-maintainers

ArchitectureVersionStatusForBuilddStateMiscLogs
Buildd exposure stats armhf  1.3.0-4Build-Attempted65d 3h 52mmb-lxc-02out-of-datemisc:extraold | all (3)

Tail of log for wlcs on armhf:

make[3]: Leaving directory '/<<PKGBUILDDIR>>/obj-arm-linux-gnueabihf'
make[2]: *** [CMakeFiles/Makefile2:172: CMakeFiles/wlcs.asan.dir/all] Error 2
make[2]: *** Waiting for unfinished jobs....
[ 96%] Building CXX object CMakeFiles/wlcs.ubsan.dir/tests/self_test.cpp.o
/usr/bin/c++ -D_FILE_OFFSET_BITS=64 -D_GNU_SOURCE -I/<<PKGBUILDDIR>>/include -I/usr/src/googletest/googlemock/include -I/<<PKGBUILDDIR>>/obj-arm-linux-gnueabihf -g -O2 -ffile-prefix-map=/<<PKGBUILDDIR>>=. -fstack-protector-strong -Wformat -Werror=format-security -Wdate-time -D_FORTIFY_SOURCE=2 -pthread -g -Werror -Wall -fno-strict-aliasing -pedantic -Wnon-virtual-dtor -Wextra -fPIC -fsanitize=undefined -DGTEST_HAS_PTHREAD=1 -std=c++17 -MD -MT CMakeFiles/wlcs.ubsan.dir/tests/self_test.cpp.o -MF CMakeFiles/wlcs.ubsan.dir/tests/self_test.cpp.o.d -o CMakeFiles/wlcs.ubsan.dir/tests/self_test.cpp.o -c /<<PKGBUILDDIR>>/tests/self_test.cpp
[ 97%] Linking CXX executable wlcs.ubsan
/usr/bin/cmake -E cmake_link_script CMakeFiles/wlcs.ubsan.dir/link.txt --verbose=1
/usr/bin/c++ -g -O2 -ffile-prefix-map=/<<PKGBUILDDIR>>=. -fstack-protector-strong -Wformat -Werror=format-security -Wdate-time -D_FORTIFY_SOURCE=2 -pthread -g -Werror -Wall -fno-strict-aliasing -pedantic -Wnon-virtual-dtor -Wextra -fPIC -Wl,-z,relro -Wl,-z,now -fsanitize=undefined CMakeFiles/wlcs.ubsan.dir/src/data_device.cpp.o CMakeFiles/wlcs.ubsan.dir/src/gtk_primary_selection.cpp.o CMakeFiles/wlcs.ubsan.dir/src/helpers.cpp.o CMakeFiles/wlcs.ubsan.dir/src/in_process_server.cpp.o CMakeFiles/wlcs.ubsan.dir/src/xdg_shell_v6.cpp.o CMakeFiles/wlcs.ubsan.dir/src/xdg_shell_stable.cpp.o CMakeFiles/wlcs.ubsan.dir/src/layer_shell_v1.cpp.o CMakeFiles/wlcs.ubsan.dir/src/main.cpp.o CMakeFiles/wlcs.ubsan.dir/src/pointer_constraints_unstable_v1.cpp.o CMakeFiles/wlcs.ubsan.dir/src/primary_selection.cpp.o CMakeFiles/wlcs.ubsan.dir/src/shared_library.cpp.o CMakeFiles/wlcs.ubsan.dir/src/relative_pointer_unstable_v1.cpp.o CMakeFiles/wlcs.ubsan.dir/src/xfail_supporting_test_listener.cpp.o CMakeFiles/wlcs.ubsan.dir/src/xdg_output_v1.cpp.o CMakeFiles/wlcs.ubsan.dir/src/version_specifier.cpp.o CMakeFiles/wlcs.ubsan.dir/src/surface_builder.cpp.o CMakeFiles/wlcs.ubsan.dir/src/input_method.cpp.o CMakeFiles/wlcs.ubsan.dir/generated/gtk-primary-selection.c.o CMakeFiles/wlcs.ubsan.dir/generated/primary-selection-unstable-v1.c.o CMakeFiles/wlcs.ubsan.dir/generated/wayland.c.o CMakeFiles/wlcs.ubsan.dir/generated/xdg-shell-unstable-v6.c.o CMakeFiles/wlcs.ubsan.dir/generated/xdg-shell.c.o CMakeFiles/wlcs.ubsan.dir/generated/wlr-layer-shell-unstable-v1.c.o CMakeFiles/wlcs.ubsan.dir/generated/xdg-output-unstable-v1.c.o CMakeFiles/wlcs.ubsan.dir/generated/wlr-foreign-toplevel-management-unstable-v1.c.o CMakeFiles/wlcs.ubsan.dir/generated/pointer-constraints-unstable-v1.c.o CMakeFiles/wlcs.ubsan.dir/generated/relative-pointer-unstable-v1.c.o CMakeFiles/wlcs.ubsan.dir/tests/test_bad_buffer.cpp.o CMakeFiles/wlcs.ubsan.dir/tests/pointer_constraints.cpp.o CMakeFiles/wlcs.ubsan.dir/tests/copy_cut_paste.cpp.o CMakeFiles/wlcs.ubsan.dir/tests/gtk_primary_selection.cpp.o CMakeFiles/wlcs.ubsan.dir/tests/test_surface_events.cpp.o CMakeFiles/wlcs.ubsan.dir/tests/touches.cpp.o CMakeFiles/wlcs.ubsan.dir/tests/wl_output.cpp.o CMakeFiles/wlcs.ubsan.dir/tests/surface_input_regions.cpp.o CMakeFiles/wlcs.ubsan.dir/tests/frame_submission.cpp.o CMakeFiles/wlcs.ubsan.dir/tests/primary_selection.cpp.o CMakeFiles/wlcs.ubsan.dir/tests/relative_pointer.cpp.o CMakeFiles/wlcs.ubsan.dir/tests/subsurfaces.cpp.o CMakeFiles/wlcs.ubsan.dir/tests/xdg_surface_v6.cpp.o CMakeFiles/wlcs.ubsan.dir/tests/xdg_toplevel_v6.cpp.o CMakeFiles/wlcs.ubsan.dir/tests/xdg_surface_stable.cpp.o CMakeFiles/wlcs.ubsan.dir/tests/xdg_toplevel_stable.cpp.o CMakeFiles/wlcs.ubsan.dir/tests/xdg_popup.cpp.o CMakeFiles/wlcs.ubsan.dir/tests/wlr_layer_shell_v1.cpp.o CMakeFiles/wlcs.ubsan.dir/tests/xdg_output_v1.cpp.o CMakeFiles/wlcs.ubsan.dir/tests/wlr_foreign_toplevel_management_v1.cpp.o CMakeFiles/wlcs.ubsan.dir/tests/self_test.cpp.o -o wlcs.ubsan  -lubsan -L/usr/lib/arm-linux-gnueabihf -lwayland-client -lwayland-client -L/usr/lib/arm-linux-gnueabihf -lwayland-server -lwayland-client -ldl libGMock.a /usr/lib/arm-linux-gnueabihf/libgtest.a -lwayland-server -ldl 
make[3]: Leaving directory '/<<PKGBUILDDIR>>/obj-arm-linux-gnueabihf'
[ 99%] Built target wlcs.ubsan
make[2]: Leaving directory '/<<PKGBUILDDIR>>/obj-arm-linux-gnueabihf'
make[1]: *** [Makefile:139: all] Error 2
make[1]: Leaving directory '/<<PKGBUILDDIR>>/obj-arm-linux-gnueabihf'
dh_auto_build: error: cd obj-arm-linux-gnueabihf && make -j4 "INSTALL=install --strip-program=true" VERBOSE=1 returned exit code 2
make: *** [debian/rules:45: binary-arch] Error 25