Raspbian Package Auto-Building

Buildd status for vnc4 (wheezy-staging)

Debian PTSTrackerChangelogBugspackages.d.obuildd.d.o

Package(s): Suite:
Compact mode Co-maintainers

ArchitectureVersionStatusForBuilddStateMiscLogs
Buildd exposure stats armhf  4.1.1+X4.3.0-37.1Build-Attempted1401d 7h 27mtestwandboarduncompiledx11:sourceold | all (6)

Tail of log for vnc4 on armhf:

/usr/bin/cpp -undef -traditional  -D__apploaddir__=/etc/X11/app-defaults -D__filemansuffix__=5x -D__libmansuffix__=3x -D__miscmansuffix__=7 -D__drivermansuffix__=4 -D__projectroot__=/usr/X11R6 -D__xorgversion__='"Release 6.6" "X Version 11"' -D__vendorversion__="`echo 4 3 0 | sed -e 's/ /./g' -e 's/^/Version /'` XFree86"  <Xserver.man | sed -e '/^#  *[0-9][0-9]*  *.*$/d' -e '/^XCOMM$/s//#/' -e '/^XCOMM[^a-zA-Z0-9_]/s/^XCOMM/#/' >Xserver._man
rm -f Xserver.1x.html Xserver.1x-html
../../config/util/rman -f HTML < Xserver._man \
	  > Xserver.1x-html && mv -f Xserver.1x-html Xserver.1x.html
macro "in" not recognized -- ignoring
make[5]: Leaving directory `/<<BUILDDIR>>/vnc4-4.1.1+X4.3.0/unix/xc/programs/Xserver'
make[4]: *** [all] Error 2
make[4]: Leaving directory `/<<BUILDDIR>>/vnc4-4.1.1+X4.3.0/unix/xc/programs'
make[3]: *** [all] Error 2
make[3]: Leaving directory `/<<BUILDDIR>>/vnc4-4.1.1+X4.3.0/unix/xc'
make[2]: *** [World] Error 2
make[2]: Leaving directory `/<<BUILDDIR>>/vnc4-4.1.1+X4.3.0/unix/xc'
make[1]: *** [World] Error 2
make[1]: Leaving directory `/<<BUILDDIR>>/vnc4-4.1.1+X4.3.0/unix/xc'
make: *** [build-arch-x-stamp] Error 2