Raspbian Package Auto-Building

Buildd status for selected packages (stretch-staging)

Bugs

Package(s): Suite:
Compact mode Co-maintainers

Package armhf
Buildd exposure stats
✘ vite  Build-Attempted
✘ myproxy  Build-Attempted
✘ gnome-control-center  Build-Attempted
✘ mpqc3  Build-Attempted
✘ patat  Build-Attempted
✔ ckBuild-Attempted
✔ cpl-plugin-xshBuild-Attempted
✔ ezquakeBuild-Attempted
✔ gambcBuild-Attempted
✔ sdrangeloveBuild-Attempted
✔ coneBuild-Attempted
✔ kritaBuild-Attempted
✔ chromium-browserBuild-Attempted
✘ neovim  Build-Attempted
✘ wysihtml  Build-Attempted

Tail of log for vite on armhf:

src/CMakeFiles/vite.dir/build.make:1035: recipe for target 'src/CMakeFiles/vite.dir/render/render_stats_opengl.cpp.o' failed
make[4]: *** [src/CMakeFiles/vite.dir/render/render_stats_opengl.cpp.o] Error 1
make[4]: Leaving directory '/<<BUILDDIR>>/vite-1.2+svn1430/obj-arm-linux-gnueabihf'
CMakeFiles/Makefile2:121: recipe for target 'src/CMakeFiles/vite.dir/all' failed
make[3]: *** [src/CMakeFiles/vite.dir/all] Error 2
make[3]: Leaving directory '/<<BUILDDIR>>/vite-1.2+svn1430/obj-arm-linux-gnueabihf'
Makefile:152: recipe for target 'all' failed
make[2]: *** [all] Error 2
make[2]: Leaving directory '/<<BUILDDIR>>/vite-1.2+svn1430/obj-arm-linux-gnueabihf'
dh_auto_build: make -j4 returned exit code 2
debian/rules:11: recipe for target 'override_dh_auto_build' failed
make[1]: *** [override_dh_auto_build] Error 2
make[1]: Leaving directory '/<<BUILDDIR>>/vite-1.2+svn1430'
debian/rules:4: recipe for target 'build-arch' failed
make: *** [build-arch] Error 2

Tail of log for myproxy on armhf:

============================================================================
Makefile:1495: recipe for target 'test-suite.log' failed
make[4]: *** [test-suite.log] Error 1
make[4]: Leaving directory '/<<PKGBUILDDIR>>'
Makefile:1601: recipe for target 'check-TESTS' failed
make[3]: *** [check-TESTS] Error 2
make[3]: Leaving directory '/<<PKGBUILDDIR>>'
Makefile:1832: recipe for target 'check-am' failed
make[2]: *** [check-am] Error 2
make[2]: Leaving directory '/<<PKGBUILDDIR>>'
Makefile:1381: recipe for target 'check-recursive' failed
make[1]: *** [check-recursive] Error 1
make[1]: Leaving directory '/<<PKGBUILDDIR>>'
debian/rules:60: recipe for target 'build-stamp' failed
make: *** [build-stamp] Error 2

Tail of log for gnome-control-center on armhf:

Makefile:1170: recipe for target 'all-recursive' failed
make[4]: *** [all-recursive] Error 1
make[4]: Leaving directory '/<<PKGBUILDDIR>>/shell'
Makefile:720: recipe for target 'all' failed
make[3]: *** [all] Error 2
make[3]: Leaving directory '/<<PKGBUILDDIR>>/shell'
Makefile:542: recipe for target 'all-recursive' failed
make[2]: *** [all-recursive] Error 1
make[2]: Leaving directory '/<<PKGBUILDDIR>>'
Makefile:474: recipe for target 'all' failed
make[1]: *** [all] Error 2
make[1]: Leaving directory '/<<PKGBUILDDIR>>'
dh_auto_build: make -j4 returned exit code 2
debian/rules:9: recipe for target 'build-arch' failed
make: *** [build-arch] Error 2

Tail of log for mpqc3 on armhf:

[ 70%] Building CXX object src/lib/chemistry/qc/mbptr12/CMakeFiles/mbptr12.dir/twobody_intermediates_ta.cc.o
cd "/<<PKGBUILDDIR>>/obj-arm-linux-gnueabihf/src/lib/chemistry/qc/mbptr12" && /usr/bin/c++   -DHAVE_CONFIG_H -DMPQC_NEW_FEATURES -DMPQC_R12 -I"/<<PKGBUILDDIR>>/obj-arm-linux-gnueabihf/src/lib" -I"/<<PKGBUILDDIR>>/src/lib" -I"/<<PKGBUILDDIR>>/include" -I/usr/include/mpich -I/usr/include/eigen3 -I/usr/include/openbabel-2.0 -I/usr/include/libint2 -I/usr/include/TiledArray/external  -std=c++11 -g -O2 -std=c++11   -o CMakeFiles/mbptr12.dir/twobody_intermediates_ta.cc.o -c "/<<PKGBUILDDIR>>/src/lib/chemistry/qc/mbptr12/twobody_intermediates_ta.cc"
virtual memory exhausted: Cannot allocate memory
src/lib/chemistry/qc/mbptr12/CMakeFiles/mbptr12.dir/build.make:1049: recipe for target 'src/lib/chemistry/qc/mbptr12/CMakeFiles/mbptr12.dir/twobody_intermediates_ta.cc.o' failed
make[3]: *** [src/lib/chemistry/qc/mbptr12/CMakeFiles/mbptr12.dir/twobody_intermediates_ta.cc.o] Error 1
make[3]: Leaving directory '/<<PKGBUILDDIR>>/obj-arm-linux-gnueabihf'
CMakeFiles/Makefile2:3056: recipe for target 'src/lib/chemistry/qc/mbptr12/CMakeFiles/mbptr12.dir/all' failed
make[2]: *** [src/lib/chemistry/qc/mbptr12/CMakeFiles/mbptr12.dir/all] Error 2
make[2]: Leaving directory '/<<PKGBUILDDIR>>/obj-arm-linux-gnueabihf'
Makefile:141: recipe for target 'all' failed
make[1]: *** [all] Error 2
make[1]: Leaving directory '/<<PKGBUILDDIR>>/obj-arm-linux-gnueabihf'
dh_auto_build: make -j1 returned exit code 2
debian/rules:8: recipe for target 'build-arch' failed
make: *** [build-arch] Error 2

Tail of log for patat on armhf:

patat:             Install signal handlers (default: yes)
patat:   -e<n>     Maximum number of outstanding local sparks (default: 4096)
patat:   -xq       The allocation limit given to a thread after it receives
patat:             an AllocationLimitExceeded exception. (default: 100k)
patat: 
patat: RTS options may also be specified using the GHCRTS environment variable.
patat: 
patat: Other RTS options may be available for programs compiled a different way.
patat: The GHC User's Guide has full details.
patat: 
debian/rules:21: recipe for target 'override_dh_auto_test' failed
make[1]: *** [override_dh_auto_test] Error 1
make[1]: Leaving directory '/<<PKGBUILDDIR>>'
debian/rules:6: recipe for target 'build-arch' failed
make: *** [build-arch] Error 2

Tail of log for ck on armhf:

{standard input}:773: Error: selected processor does not support `strexbeq r2,r8,[r5]' in ARM mode
Makefile:18: recipe for target 'ck_pr_cas' failed
make[4]: *** [ck_pr_cas] Error 1
make[4]: Leaving directory '/<<PKGBUILDDIR>>/regressions/ck_pr/validate'
Makefile:29: recipe for target 'all' failed
make[3]: *** [all] Error 2
make[3]: Leaving directory '/<<PKGBUILDDIR>>/regressions'
Makefile:27: recipe for target 'regressions' failed
make[2]: *** [regressions] Error 2
make[2]: Leaving directory '/<<PKGBUILDDIR>>'
debian/rules:15: recipe for target 'override_dh_auto_test' failed
make[1]: *** [override_dh_auto_test] Error 2
make[1]: Leaving directory '/<<PKGBUILDDIR>>'
debian/rules:18: recipe for target 'build-arch' failed
make: *** [build-arch] Error 2

Tail of log for cpl-plugin-xsh on armhf:

Makefile:849: recipe for target 'xsh_utils.lo' failed
make[4]: *** [xsh_utils.lo] Error 1
make[4]: Leaving directory '/<<BUILDDIR>>/cpl-plugin-xsh-2.3.0+dfsg/xsh'
Makefile:885: recipe for target 'all-recursive' failed
make[3]: *** [all-recursive] Error 1
make[3]: Leaving directory '/<<BUILDDIR>>/cpl-plugin-xsh-2.3.0+dfsg/xsh'
Makefile:530: recipe for target 'all-recursive' failed
make[2]: *** [all-recursive] Error 1
make[2]: Leaving directory '/<<BUILDDIR>>/cpl-plugin-xsh-2.3.0+dfsg'
Makefile:436: recipe for target 'all' failed
make[1]: *** [all] Error 2
make[1]: Leaving directory '/<<BUILDDIR>>/cpl-plugin-xsh-2.3.0+dfsg'
dh_auto_build: make -j1 returned exit code 2
debian/rules:14: recipe for target 'build-arch' failed
make: *** [build-arch] Error 2

Tail of log for ezquake on armhf:

mkdir -p .ezquake
cc -c -g -O2 -fdebug-prefix-map=/<<BUILDDIR>>/ezquake-2.2+git20150324=. -fstack-protector-strong -Wformat -Werror=format-security -Wdate-time -D_FORTIFY_SOURCE=2   -fvisibility=hidden -DCPUSTRING='"arm"' -DBUILDSTRING='"Linux"' -DREVISION=666 -DVERSION='"r666"'  -I/usr/include/SDL2 -D_REENTRANT -DJSS_CAM -DUSE_PR2 -DWITH_NQPROGS -DUSE_SDL2 -DWITH_ZIP -DWITH_ZLIB   -I/usr/include/libpng16 -DWITH_PNG -D__Q_PNG14__ -I/usr/include/arm-linux-gnueabihf -o .ezquake/pr_exec.o pr_exec.c
mkdir -p .ezquake
cc -c -g -O2 -fdebug-prefix-map=/<<BUILDDIR>>/ezquake-2.2+git20150324=. -fstack-protector-strong -Wformat -Werror=format-security -Wdate-time -D_FORTIFY_SOURCE=2   -fvisibility=hidden -DCPUSTRING='"arm"' -DBUILDSTRING='"Linux"' -DREVISION=666 -DVERSION='"r666"'  -I/usr/include/SDL2 -D_REENTRANT -DJSS_CAM -DUSE_PR2 -DWITH_NQPROGS -DUSE_SDL2 -DWITH_ZIP -DWITH_ZLIB   -I/usr/include/libpng16 -DWITH_PNG -D__Q_PNG14__ -I/usr/include/arm-linux-gnueabihf -o .ezquake/pr2_cmds.o pr2_cmds.c
pr2_cmds.c: In function 'sv_syscall':
pr2_cmds.c:3007:2: error: cannot convert to a pointer type
  pr2_API[arg] ( 0, (unsigned int) ~0, (pr2val_t*)ap, &ret);
  ^~~~~~~
Makefile:385: recipe for target '.ezquake/pr2_cmds.o' failed
make[1]: *** [.ezquake/pr2_cmds.o] Error 1
make[1]: *** Waiting for unfinished jobs....
make[1]: Leaving directory '/<<BUILDDIR>>/ezquake-2.2+git20150324'
dh_auto_build: make -j4 returned exit code 2
debian/rules:14: recipe for target 'build-arch' failed
make: *** [build-arch] Error 2

Tail of log for gambc on armhf:

making all in gsi
make[2]: Entering directory '/<<PKGBUILDDIR>>/gsi'
make[2]: Leaving directory '/<<PKGBUILDDIR>>/gsi'
making all in gsc
make[2]: Entering directory '/<<PKGBUILDDIR>>/gsc'
LD_LIBRARY_PATH=../lib:../gsi:../gsc: ../gsc-comp -:=.. -f -c -check _gsclib.scm
Segmentation fault
makefile:176: recipe for target '_gsclib.c' failed
make[2]: *** [_gsclib.c] Error 139
make[2]: Leaving directory '/<<PKGBUILDDIR>>/gsc'
makefile:216: recipe for target 'all-recursive' failed
make[1]: *** [all-recursive] Error 1
make[1]: Leaving directory '/<<PKGBUILDDIR>>'
debian/rules:44: recipe for target 'build-stamp' failed
make: *** [build-stamp] Error 2

Tail of log for sdrangelove on armhf:

    Feature record: CXX_FEATURE:0cxx_static_assert
    Feature record: CXX_FEATURE:0cxx_strong_enums
    Feature record: CXX_FEATURE:1cxx_template_template_parameters
    Feature record: CXX_FEATURE:0cxx_thread_local
    Feature record: CXX_FEATURE:0cxx_trailing_return_types
    Feature record: CXX_FEATURE:0cxx_unicode_literals
    Feature record: CXX_FEATURE:0cxx_uniform_initialization
    Feature record: CXX_FEATURE:0cxx_unrestricted_unions
    Feature record: CXX_FEATURE:0cxx_user_literals
    Feature record: CXX_FEATURE:0cxx_variable_templates
    Feature record: CXX_FEATURE:0cxx_variadic_macros
    Feature record: CXX_FEATURE:0cxx_variadic_templates
dh_auto_configure: cmake .. -DCMAKE_INSTALL_PREFIX=/usr -DCMAKE_VERBOSE_MAKEFILE=ON -DCMAKE_BUILD_TYPE=None -DCMAKE_INSTALL_SYSCONFDIR=/etc -DCMAKE_INSTALL_LOCALSTATEDIR=/var returned exit code 1
debian/rules:14: recipe for target 'build-arch' failed
make: *** [build-arch] Error 2

Tail of log for cone on armhf:

make[5]: Leaving directory '/<<PKGBUILDDIR>>/cone'
Makefile:970: recipe for target 'all-recursive' failed
make[4]: *** [all-recursive] Error 1
make[4]: Leaving directory '/<<PKGBUILDDIR>>/cone'
Makefile:617: recipe for target 'all' failed
make[3]: *** [all] Error 2
make[3]: Leaving directory '/<<PKGBUILDDIR>>/cone'
Makefile:370: recipe for target 'all-recursive' failed
make[2]: *** [all-recursive] Error 1
make[2]: Leaving directory '/<<PKGBUILDDIR>>'
Makefile:275: recipe for target 'all' failed
make[1]: *** [all] Error 2
make[1]: Leaving directory '/<<PKGBUILDDIR>>'
/usr/share/cdbs/1/class/makefile.mk:77: recipe for target 'debian/stamp-makefile-build' failed
make: *** [debian/stamp-makefile-build] Error 2

Tail of log for krita on armhf:

/<<BUILDDIR>>/krita-3.1.1+dfsg/libs/ui/opengl/kis_opengl_image_textures.cpp:591:45: error: 'GL_RGBA16' was not declared in this scope
             m_texturesInfo.internalFormat = GL_RGBA16;
                                             ^~~~~~~~~
libs/ui/CMakeFiles/kritaui.dir/build.make:3789: recipe for target 'libs/ui/CMakeFiles/kritaui.dir/opengl/kis_opengl_image_textures.cpp.o' failed
make[3]: *** [libs/ui/CMakeFiles/kritaui.dir/opengl/kis_opengl_image_textures.cpp.o] Error 1
make[3]: Leaving directory '/<<BUILDDIR>>/krita-3.1.1+dfsg/obj-arm-linux-gnueabihf'
CMakeFiles/Makefile2:18345: recipe for target 'libs/ui/CMakeFiles/kritaui.dir/all' failed
make[2]: *** [libs/ui/CMakeFiles/kritaui.dir/all] Error 2
make[2]: Leaving directory '/<<BUILDDIR>>/krita-3.1.1+dfsg/obj-arm-linux-gnueabihf'
Makefile:141: recipe for target 'all' failed
make[1]: *** [all] Error 2
make[1]: Leaving directory '/<<BUILDDIR>>/krita-3.1.1+dfsg/obj-arm-linux-gnueabihf'
dh_auto_build: make -j4 returned exit code 2
debian/rules:18: recipe for target 'build-arch' failed
make: *** [build-arch] Error 2

Tail of log for chromium-browser on armhf:

This overwrites a previously-defined nonempty list with another nonempty list.
See //third_party/skia/third_party/skcms/skcms.gni:7:15: for previous definition
    defines = [ "SKCMS_PORTABLE=1" ]
              ^--------------------
Did you mean to append/modify instead? If you really want to overwrite, do:
  foo = []
before reassigning.
See //BUILD.gn:69:5: which caused the file to be included.
    "//skia:skia_unittests",
    ^----------------------
debian/rules:96: recipe for target 'override_dh_auto_configure' failed
make[1]: *** [override_dh_auto_configure] Error 1
make[1]: Leaving directory '/<<PKGBUILDDIR>>'
debian/rules:93: recipe for target 'build-arch' failed
make: *** [build-arch] Error 2

Tail of log for neovim on armhf:

CMake Error at /<<PKGBUILDDIR>>/cmake/RunTests.cmake:46 (message):
  Running functional tests failed with error: 1.


FAILED: CMakeFiles/functionaltest 
cd /<<PKGBUILDDIR>>/build && /usr/bin/cmake -DBUSTED_PRG=/usr/bin/busted -DLUA_PRG=/usr/bin/luajit -DNVIM_PRG=/<<PKGBUILDDIR>>/build/bin/nvim -DWORKING_DIR=/<<PKGBUILDDIR>> -DBUSTED_OUTPUT_TYPE=TAP -DTEST_DIR=/<<PKGBUILDDIR>>/test -DBUILD_DIR=/<<PKGBUILDDIR>>/build -DTEST_TYPE=functional -DSYSTEM_NAME=Linux -P /<<PKGBUILDDIR>>/cmake/RunTests.cmake
ninja: build stopped: subcommand failed.
Makefile:95: recipe for target 'functionaltest' failed
make[2]: *** [functionaltest] Error 1
make[2]: Leaving directory '/<<PKGBUILDDIR>>'
debian/rules:55: recipe for target 'override_dh_auto_test-arch' failed
make[1]: *** [override_dh_auto_test-arch] Error 2
make[1]: Leaving directory '/<<PKGBUILDDIR>>'
debian/rules:30: recipe for target 'build-arch' failed
make: *** [build-arch] Error 2

BinNMU changelog for wysihtml on armhf:

rebuild due to debcheck failure

Tail of log for wysihtml on armhf:

dh_testdir
dh_testroot
rm -f build-stamp 
rm -rf debian/tmp-info
# Add here commands to clean up after the build process.
/usr/bin/make distclean
make[1]: Entering directory '/<<PKGBUILDDIR>>'
make[1]: *** No rule to make target 'distclean'.  Stop.
make[1]: Leaving directory '/<<PKGBUILDDIR>>'
debian/rules:48: recipe for target 'clean' failed
make: [clean] Error 2 (ignored)
dh_clean
dh_clean: Please specify the compatibility level in debian/compat
debian/rules:48: recipe for target 'clean' failed
make: *** [clean] Error 2