Raspbian Package Auto-Building

Buildd status for virt-v2v (bookworm-staging)

Debian PTSTrackerChangelogBugspackages.d.obuildd.d.o

Package(s): Suite:
Compact mode Co-maintainers

ArchitectureVersionStatusForBuilddStateMiscLogs
Buildd exposure stats armhf  1.44.0-1Build-Attempted29d 11h 43mmb-lxc-01uncompiledmisc:sourceold | all (3)

Tail of log for virt-v2v on armhf:

make[4]: Leaving directory '/<<PKGBUILDDIR>>/test-data/binaries'
Making all in blank-disks
make[4]: Entering directory '/<<PKGBUILDDIR>>/test-data/blank-disks'
qemu-img create -f raw blank-disk-1s.raw 512
/bin/bash: line 1: qemu-img: command not found
make[4]: *** [Makefile:717: blank-disk-1s.raw] Error 127
make[4]: Leaving directory '/<<PKGBUILDDIR>>/test-data/blank-disks'
make[3]: *** [Makefile:626: all-recursive] Error 1
make[3]: Leaving directory '/<<PKGBUILDDIR>>/test-data'
make[2]: *** [Makefile:848: all-recursive] Error 1
make[2]: Leaving directory '/<<PKGBUILDDIR>>'
make[1]: *** [Makefile:766: all] Error 2
make[1]: Leaving directory '/<<PKGBUILDDIR>>'
dh_auto_build: error: make -j4 returned exit code 2
make: *** [debian/rules:4: binary-arch] Error 25