Raspbian Package Auto-Building

Buildd status for uvloop (bookworm-staging)

Debian PTSTrackerChangelogBugspackages.d.obuildd.d.o

Package(s): Suite:
Compact mode Co-maintainers

ArchitectureVersionStatusForBuilddStateMiscLogs
Buildd exposure stats armhf  0.16.0+ds1-1Build-Attempted30d 22h 38mbm-wb-03out-of-datemisc:optionalold | all (2)

Tail of log for uvloop on armhf:

.pybuild/cpython3_3.9_uvloop/build/tests/test_process.py: 32 warnings
.pybuild/cpython3_3.9_uvloop/build/tests/test_signals.py: 14 warnings
  /usr/lib/python3.9/asyncio/subprocess.py:196: DeprecationWarning: The loop argument is deprecated since Python 3.8, and scheduled for removal in Python 3.10.
    stdin, stdout, stderr = await tasks.gather(stdin, stdout, stderr,

-- Docs: https://docs.pytest.org/en/stable/warnings.html
=========================== short test summary info ============================
FAILED tests/test_unix.py::Test_UV_UnixSSL::test_create_unix_connection_ssl_1
FAILED tests/test_unix.py::Test_UV_UnixSSL::test_create_unix_server_ssl_1 - a...
FAILED tests/test_unix.py::Test_AIO_UnixSSL::test_create_unix_connection_ssl_1
FAILED tests/test_unix.py::Test_AIO_UnixSSL::test_create_unix_server_ssl_1 - ...
====== 4 failed, 329 passed, 5 skipped, 81 warnings in 243.81s (0:04:03) =======
E: pybuild pybuild:353: test: plugin distutils failed with: exit code=1: cd /<<BUILDDIR>>/uvloop-0.16.0+ds1/.pybuild/cpython3_3.9_uvloop/build; python3.9 -m pytest -s tests --ignore=tests/test_pipes.py --ignore=tests/test_sourcecode.py --ignore=tests/test_sockets.py --ignore=tests/test_tcp.py
dh_auto_test: error: pybuild --test --test-pytest -i python{version} -p 3.9 returned exit code 13
make: *** [debian/rules:14: build-arch] Error 25