Raspbian Package Auto-Building

Buildd status for urjtag (wheezy-staging)

Debian PTSTrackerChangelogBugspackages.d.obuildd.d.o

Package(s): Suite:
Compact mode Co-maintainers

ArchitectureVersionStatusForBuilddStateMiscLogs
Buildd exposure stats armhf  0.10+r2007-1Build-Attempted1401d 9h 39mbm-wb-02uncompiledembedded:sourceold | all (5)

Tail of log for urjtag on armhf:

../../include/urjtag/bfin.h:40:55: error: redeclaration of enumerator 'REG_R5'
/usr/include/arm-linux-gnueabihf/sys/ucontext.h:52:3: note: previous definition of 'REG_R5' was here
../../include/urjtag/bfin.h:40:63: error: redeclaration of enumerator 'REG_R6'
/usr/include/arm-linux-gnueabihf/sys/ucontext.h:54:3: note: previous definition of 'REG_R6' was here
../../include/urjtag/bfin.h:40:71: error: redeclaration of enumerator 'REG_R7'
/usr/include/arm-linux-gnueabihf/sys/ucontext.h:56:3: note: previous definition of 'REG_R7' was here
make[4]: *** [cmd_bfin.lo] Error 1
make[4]: Leaving directory `/<<BUILDDIR>>/urjtag-0.10+r2007/src/cmd'
make[3]: *** [all-recursive] Error 1
make[3]: Leaving directory `/<<BUILDDIR>>/urjtag-0.10+r2007/src'
make[2]: *** [all-recursive] Error 1
make[2]: Leaving directory `/<<BUILDDIR>>/urjtag-0.10+r2007'
make[1]: *** [all] Error 2
make[1]: Leaving directory `/<<BUILDDIR>>/urjtag-0.10+r2007'
make: *** [debian/stamp-makefile-build] Error 2