Raspbian Package Auto-Building

Buildd status for tulip, cone, hyperspy (bookworm-staging)

Bugs

Package(s): Suite:
Compact mode Co-maintainers

Package armhf
Buildd exposure stats
✔ tulipMaybe-Failed
✔ coneMaybe-Failed
✔ hyperspyMaybe-Failed

Tail of log for tulip on armhf:

                 from /usr/include/arm-linux-gnueabihf/qt5/QtGui/QOpenGLContext:1,
                 from ../library/tulip-gui/src/GlOffscreenRenderer.cpp:29:
/usr/include/GLES3/gl32.h:1821:187: error: ‘void __glewTexStorage3DMultisample(GLenum, GLsizei, GLenum, GLsizei, GLsizei, GLsizei, GLboolean)’ redeclared as different kind of entity
 1821 | GL_APICALL void GL_APIENTRY glTexStorage3DMultisample (GLenum target, GLsizei samples, GLenum internalformat, GLsizei width, GLsizei height, GLsizei depth, GLboolean fixedsamplelocations);
      |                                                                                                                                                                                           ^
In file included from ../library/tulip-gui/src/GlOffscreenRenderer.cpp:24:
/usr/include/GL/glew.h:20901:50: note: previous declaration ‘void (* __glewTexStorage3DMultisample)(GLenum, GLsizei, GLenum, GLsizei, GLsizei, GLsizei, GLboolean)’
20901 | GLEW_FUN_EXPORT PFNGLTEXSTORAGE3DMULTISAMPLEPROC __glewTexStorage3DMultisample;
      |                                                  ^~~~~~~~~~~~~~~~~~~~~~~~~~~~~
[1030/1775] /usr/bin/c++ -DQT_CORE_LIB -DQT_DLL -DQT_GUI_LIB -DQT_NETWORK_LIB -DQT_NO_DEBUG -DQT_THREAD_SUPPORT -DQT_WIDGETS_LIB -DTULIP_BUILD_PYTHON_COMPONENTS -D_LINUX -Dtulip_gui_5_4_EXPORTS -Ilibrary/tulip-gui/include -Ilibrary/tulip-core/include -I../library/tulip-core/include -I../library/tulip-ogl/include -I../library/tulip-gui/include -Ilibrary/tulip-gui/src -I/usr/include/quazip5 -isystem /usr/include/arm-linux-gnueabihf/qt5 -isystem /usr/include/arm-linux-gnueabihf/qt5/QtWidgets -isystem /usr/include/arm-linux-gnueabihf/qt5/QtGui -isystem /usr/include/arm-linux-gnueabihf/qt5/QtCore -isystem /usr/lib/arm-linux-gnueabihf/qt5/mkspecs/linux-g++ -isystem /usr/include/arm-linux-gnueabihf/qt5/QtNetwork -g -O2 -ffile-prefix-map=/<<PKGBUILDDIR>>=. -fstack-protector-strong -Wformat -Werror=format-security -Wdate-time -D_FORTIFY_SOURCE=2 -Wall -Wextra -Wunused -Wno-long-long -Wold-style-cast -pedantic -Wimplicit-fallthrough=0 -O3 -DNDEBUG -fopenmp -fPIC -fPIC -MD -MT library/tulip-gui/src/CMakeFiles/tulip-gui-5.4.dir/CopyPropertyDialog.cpp.o -MF library/tulip-gui/src/CMakeFiles/tulip-gui-5.4.dir/CopyPropertyDialog.cpp.o.d -o library/tulip-gui/src/CMakeFiles/tulip-gui-5.4.dir/CopyPropertyDialog.cpp.o -c ../library/tulip-gui/src/CopyPropertyDialog.cpp
ninja: build stopped: subcommand failed.
dh_auto_build: error: cd obj-arm-linux-gnueabihf && LC_ALL=C.UTF-8 ninja -j4 -v returned exit code 1
make[1]: *** [debian/rules:14: override_dh_auto_build-arch] Error 25
make[1]: Leaving directory '/<<PKGBUILDDIR>>'
make: *** [debian/rules:8: binary-arch] Error 2

Tail of log for cone on armhf:

myserverremoteconfig.C: In member function 'mail::account* myServer::remoteConfig::login2()':
myserverremoteconfig.C:145:11: error: cannot convert 'bool' to 'mail::account*' in return
  145 |    return false;
      |           ^~~~~
make[5]: *** [Makefile:849: myserverremoteconfig.o] Error 1
make[5]: Leaving directory '/<<PKGBUILDDIR>>/cone'
make[4]: *** [Makefile:970: all-recursive] Error 1
make[4]: Leaving directory '/<<PKGBUILDDIR>>/cone'
make[3]: *** [Makefile:617: all] Error 2
make[3]: Leaving directory '/<<PKGBUILDDIR>>/cone'
make[2]: *** [Makefile:370: all-recursive] Error 1
make[2]: Leaving directory '/<<PKGBUILDDIR>>'
make[1]: *** [Makefile:275: all] Error 2
make[1]: Leaving directory '/<<PKGBUILDDIR>>'
make: *** [/usr/share/cdbs/1/class/makefile.mk:77: debian/stamp-makefile-build] Error 2

Tail of log for hyperspy on armhf:

SKIPPED [1] hyperspy/tests/signal/test_tools.py:241: LazySignals do not support masked arrays
SKIPPED [1] hyperspy/tests/signal/test_tools.py:261: LazySignals do not support masked arrays
XFAIL hyperspy/tests/drawing/test_utils.py::test_create_figure
  reason: agg backend does not support on_close event.
XFAIL hyperspy/tests/io/test_hdf5.py::TestLoadingNewSavedMetadata::test_binary_string
  dill is not guaranteed to load across Python versions
XPASS hyperspy/tests/samfire/test_samfire.py::test_multiprocessed Sometimes the number of failed pixels > 3 when using multiprocessing. Unknown reason
FAILED hyperspy/tests/misc/test_date_time_tools.py::test_serial_date_to_ISO_format
FAILED hyperspy/tests/misc/test_date_time_tools.py::test_ISO_format_to_serial_date
FAILED hyperspy/tests/misc/test_hist_tools.py::TestHistogramBinMethodsBadDataset::test_lazy_fd_logger_warning
FAILED hyperspy/tests/misc/test_hist_tools.py::TestHistogramBinMethodsBadDataset::test_lazy_deprecation_warnings[freedman]
= 4 failed, 3719 passed, 75 skipped, 2 xfailed, 1 xpassed, 77 warnings in 3287.54s (0:54:47) =
E: pybuild pybuild:353: test: plugin distutils failed with: exit code=1: cd /<<PKGBUILDDIR>>/.pybuild/cpython3_3.9_hyperspy/build; python3.9 -m pytest 
dh_auto_test: error: pybuild --test --test-pytest -i python{version} -p 3.9 returned exit code 13
make: *** [debian/rules:9: build-arch] Error 25