Raspbian Package Auto-Building

Buildd status for tulip (bookworm-staging)

Debian PTSTrackerChangelogBugspackages.d.obuildd.d.o

Package(s): Suite:
Compact mode Co-maintainers

ArchitectureVersionStatusForBuilddStateMiscLogs
Buildd exposure stats armhf  5.4.0+dfsg-3Maybe-Failed395d 22mtest2019uncompiledmisc:extraold | all (7)

Tail of log for tulip on armhf:

 1287 |           _M_realloc_insert(end(), __x);
      |           ~~~~~~~~~~~~~~~~~^~~~~~~~~~~~
In member function ‘void std::vector<_Tp, _Alloc>::push_back(const value_type&) [with _Tp = double; _Alloc = std::allocator<double>]’,
    inlined from ‘static bool tlp::SerializableVectorType<ELT_TYPE, ELT_READER, openParen>::readVector(std::istream&, std::vector<T>&, char, char, char) [with ELT_TYPE = double; ELT_READER = tlp::DoubleType; int openParen = 0]’ at /<<BUILDDIR>>/tulip-5.4.0+dfsg/library/tulip-core/include/tulip/SerializableType.h:110:22,
    inlined from ‘static bool tlp::SerializableVectorType<ELT_TYPE, ELT_READER, openParen>::read(std::istream&, typename tlp::TypeInterface<std::vector<T> >::RealType&, char, char, char) [with ELT_TYPE = double; ELT_READER = tlp::DoubleType; int openParen = 0]’ at /<<BUILDDIR>>/tulip-5.4.0+dfsg/library/tulip-core/include/tulip/SerializableType.h:144:22,
    inlined from ‘static bool tlp::SerializableVectorType<ELT_TYPE, ELT_READER, openParen>::fromString(typename tlp::TypeInterface<std::vector<T> >::RealType&, const std::string&) [with ELT_TYPE = double; ELT_READER = tlp::DoubleType; int openParen = 0]’ at /<<BUILDDIR>>/tulip-5.4.0+dfsg/library/tulip-core/include/tulip/SerializableType.h:232:3,
    inlined from ‘bool tlp::AbstractProperty<Tnode, Tedge, Tprop>::setNodeStringValue(tlp::node, const std::string&) [with Tnode = tlp::SerializableVectorType<double, tlp::DoubleType, 0>; Tedge = tlp::SerializableVectorType<double, tlp::DoubleType, 0>; Tprop = tlp::VectorPropertyInterface]’ at /<<BUILDDIR>>/tulip-5.4.0+dfsg/library/tulip-core/include/tulip/AbstractProperty.h:312:27:
/usr/include/c++/12/bits/stl_vector.h:1287:28: note: parameter passing for argument of type ‘__gnu_cxx::__normal_iterator<double*, std::vector<double, std::allocator<double> > >’ changed in GCC 7.1
 1287 |           _M_realloc_insert(end(), __x);
      |           ~~~~~~~~~~~~~~~~~^~~~~~~~~~~~
ninja: build stopped: subcommand failed.
dh_auto_build: error: cd obj-arm-linux-gnueabihf && LC_ALL=C.UTF-8 ninja -j4 -v returned exit code 1
make[1]: *** [debian/rules:14: override_dh_auto_build-arch] Error 25
make[1]: Leaving directory '/<<BUILDDIR>>/tulip-5.4.0+dfsg'
make: *** [debian/rules:8: binary-arch] Error 2