Raspbian Package Auto-Building

Buildd status for tinyarray (bullseye-staging)

Debian PTSTrackerChangelogBugspackages.d.obuildd.d.o

Package(s): Suite:
Compact mode Co-maintainers

ArchitectureVersionStatusForBuilddStateMiscLogs
Buildd exposure stats armhf  1.2.3-2Build-Attempted1d 22h 58mbm-wb-03uncompiledmisc:extraold | all (5)

Tail of log for tinyarray on armhf:

  File "/usr/lib/python3/dist-packages/pluggy/callers.py", line 187 in _multicall
  File "/usr/lib/python3/dist-packages/pluggy/manager.py", line 83 in <lambda>
  File "/usr/lib/python3/dist-packages/pluggy/manager.py", line 92 in _hookexec
  File "/usr/lib/python3/dist-packages/pluggy/hooks.py", line 286 in __call__
  File "/usr/lib/python3/dist-packages/_pytest/config/__init__.py", line 157 in main
  File "/usr/lib/python3/dist-packages/_pytest/config/__init__.py", line 180 in console_main
  File "/usr/lib/python3/dist-packages/pytest/__main__.py", line 7 in <module>
  File "/usr/lib/python3.9/runpy.py", line 87 in _run_code
  File "/usr/lib/python3.9/runpy.py", line 197 in _run_module_as_main
Aborted
E: pybuild pybuild:353: test: plugin distutils failed with: exit code=134: cd /<<PKGBUILDDIR>>/.pybuild/cpython3_3.9_tinyarray/build; python3.9 -m pytest ../../../test_tinyarray.py
dh_auto_test: error: pybuild --test --test-pytest -i python{version} -p 3.9 --test-pytest --test-args=../../../test_tinyarray.py returned exit code 13
make[1]: *** [debian/rules:11: override_dh_auto_test] Error 25
make[1]: Leaving directory '/<<PKGBUILDDIR>>'
make: *** [debian/rules:7: binary-arch] Error 2