Raspbian Package Auto-Building

Buildd status for tiledarray (bookworm-staging)

Debian PTSTrackerChangelogBugspackages.d.obuildd.d.o

Package(s): Suite:
Compact mode Co-maintainers

ArchitectureVersionStatusForBuilddStateMiscLogs
Buildd exposure stats armhf  0.6.0-5.2Build-Attempted30d 10h 29mtestbuildduncompiledmisc:sourceold | all (3)

Tail of log for tiledarray on armhf:

      |       ^~~~~~~~
/<<PKGBUILDDIR>>/src/TiledArray/math/vector_op.h:107:7: note:   template argument deduction/substitution failed:
/<<PKGBUILDDIR>>/src/TiledArray/math/vector_op.h:155:29: note:   candidate expects 2 arguments, 3 provided
  155 |       VecOpUnwindN::for_each(op, result, args...);
      |       ~~~~~~~~~~~~~~~~~~~~~~^~~~~~~~~~~~~~~~~~~~~
make[4]: *** [src/CMakeFiles/tiledarray.dir/build.make:85: src/CMakeFiles/tiledarray.dir/TiledArray/tensor/tensor.cpp.o] Error 1
make[4]: Leaving directory '/<<PKGBUILDDIR>>/obj-arm-linux-gnueabihf'
make[3]: *** [CMakeFiles/Makefile2:448: src/CMakeFiles/tiledarray.dir/all] Error 2
make[3]: Leaving directory '/<<PKGBUILDDIR>>/obj-arm-linux-gnueabihf'
make[2]: *** [Makefile:163: all] Error 2
make[2]: Leaving directory '/<<PKGBUILDDIR>>/obj-arm-linux-gnueabihf'
dh_auto_build: error: cd obj-arm-linux-gnueabihf && make -j1 VERBOSE=1 returned exit code 2
make[1]: *** [debian/rules:52: override_dh_auto_build] Error 25
make[1]: Leaving directory '/<<PKGBUILDDIR>>'
make: *** [debian/rules:40: build-arch] Error 2