Raspbian Package Auto-Building

Buildd status for thoggen (wheezy-staging)

Debian PTSTrackerChangelogBugspackages.d.obuildd.d.o

Package(s): Suite:
Compact mode Co-maintainers

ArchitectureVersionStatusForBuilddStateMiscLogs
Buildd exposure stats armhf  0.7.1-1Build-Attempted1401d 9h 26mtestwandboarduncompiledvideo:sourceold | all (5)

Tail of log for thoggen on armhf:

gcc -DHAVE_CONFIG_H -I. -I. -I.. -pthread -I/usr/include/gtk-2.0 -I/usr/include/libxml2 -I/usr/lib/arm-linux-gnueabihf/gtk-2.0/include -I/usr/include/atk-1.0 -I/usr/include/cairo -I/usr/include/gdk-pixbuf-2.0 -I/usr/include/pango-1.0 -I/usr/include/gio-unix-2.0/ -I/usr/include/glib-2.0 -I/usr/lib/arm-linux-gnueabihf/glib-2.0/include -I/usr/include/pixman-1 -I/usr/include/freetype2 -I/usr/include/libpng12 -I/usr/include/libglade-2.0   -pthread -I/usr/include/gstreamer-0.10 -I/usr/include/glib-2.0 -I/usr/lib/arm-linux-gnueabihf/glib-2.0/include -I/usr/include/libxml2   -DDBUS_API_SUBJECT_TO_CHANGE -I/usr/include/dbus-1.0 -I/usr/lib/arm-linux-gnueabihf/dbus-1.0/include -I/usr/include/hal   -I/usr/include/dbus-1.0 -I/usr/lib/arm-linux-gnueabihf/dbus-1.0/include -I/usr/include/glib-2.0 -I/usr/lib/arm-linux-gnueabihf/glib-2.0/include    -pthread -I/usr/include/gstreamer-0.10 -I/usr/include/glib-2.0 -I/usr/lib/arm-linux-gnueabihf/glib-2.0/include -I/usr/include/libxml2   -DDATADIR=\"/usr/share/thoggen\" -DLOCALEDIR=\"/usr/share/locale/\" -DISO_639_XML_PATH=\"/usr/share/xml/iso-codes/iso_639.xml\" -DISO_639_DOMAIN=\"iso_639\"  -D_FORTIFY_SOURCE=2  -Wall -g -O2 -fstack-protector --param=ssp-buffer-size=4 -Wformat -Werror=format-security -Wall -c th-app-window.c
th-app-window.c: In function 'app_window_check_free_disk_space':
th-app-window.c:1140:44: error: format not a string literal and no format arguments [-Werror=format-security]
cc1: some warnings being treated as errors
make[5]: *** [th-app-window.o] Error 1
make[5]: Leaving directory `/<<PKGBUILDDIR>>/src'
make[4]: *** [all-recursive] Error 1
make[4]: Leaving directory `/<<PKGBUILDDIR>>/src'
make[3]: *** [all] Error 2
make[3]: Leaving directory `/<<PKGBUILDDIR>>/src'
make[2]: *** [all-recursive] Error 1
make[2]: Leaving directory `/<<PKGBUILDDIR>>'
make[1]: *** [all] Error 2
make[1]: Leaving directory `/<<PKGBUILDDIR>>'
make: *** [debian/stamp-makefile-build] Error 2