Raspbian Package Auto-Building

Buildd status for tensorpipe (bullseye-staging)

Debian PTSTrackerChangelogBugspackages.d.obuildd.d.o

Package(s): Suite:
Compact mode Co-maintainers

ArchitectureVersionStatusForBuilddStateMiscLogs
Buildd exposure stats armhf  0.0~git20200928.95ff931-2Build-Attempted2d 4h 56mtest2019uncompiledmisc:optionalold | all (4)

Tail of log for tensorpipe on armhf:

/usr/bin/ld: CMakeFiles/tensorpipe_test.dir/util/ringbuffer/ringbuffer_test.cc.o: in function `std::__atomic_base<unsigned long long>::fetch_add(unsigned long long, std::memory_order)':
/usr/include/c++/10/bits/atomic_base.h:548: undefined reference to `__atomic_fetch_add_8'
/usr/bin/ld: CMakeFiles/tensorpipe_test.dir/util/ringbuffer/ringbuffer_test.cc.o: in function `std::__atomic_base<unsigned long long>::load(std::memory_order) const':
/usr/include/c++/10/bits/atomic_base.h:426: undefined reference to `__atomic_load_8'
/usr/bin/ld: /usr/include/c++/10/bits/atomic_base.h:426: undefined reference to `__atomic_load_8'
/usr/bin/ld: ../libtensorpipe.so.0: undefined reference to `__atomic_fetch_sub_8'
collect2: error: ld returned 1 exit status
make[3]: *** [tensorpipe/test/CMakeFiles/tensorpipe_test.dir/build.make:488: tensorpipe/test/tensorpipe_test] Error 1
make[3]: Leaving directory '/<<PKGBUILDDIR>>/obj-arm-linux-gnueabihf'
make[2]: *** [CMakeFiles/Makefile2:227: tensorpipe/test/CMakeFiles/tensorpipe_test.dir/all] Error 2
make[2]: Leaving directory '/<<PKGBUILDDIR>>/obj-arm-linux-gnueabihf'
make[1]: *** [Makefile:152: all] Error 2
make[1]: Leaving directory '/<<PKGBUILDDIR>>/obj-arm-linux-gnueabihf'
dh_auto_build: error: cd obj-arm-linux-gnueabihf && make -j4 "INSTALL=install --strip-program=true" VERBOSE=1 returned exit code 2
make: *** [debian/rules:9: binary-arch] Error 25