Raspbian Package Auto-Building

Buildd status for swt4-gtk (bullseye-staging)

Debian PTSTrackerChangelogBugspackages.d.obuildd.d.o

Package(s): Suite:
Compact mode Co-maintainers

ArchitectureVersionStatusForBuilddStateMiscLogs
Buildd exposure stats armhf  4.17.0-1Build-Attempted8d 10h 48mmb-lxc-02out-of-datemisc:optionalold | all (5)

Tail of log for swt4-gtk on armhf:

    [javac]  *     Christoph L??ubrich - Bug 513185
    [javac]                   ^
    [javac] /<<PKGBUILDDIR>>/bundles/org.eclipse.swt/temp.folder/@dot.src/org/eclipse/swt/layout/FillLayout.java:13: error: unmappable character (0xA4) for encoding US-ASCII
    [javac]  *     Christoph L??ubrich - Bug 513185
    [javac]                    ^
    [javac] 2 errors

BUILD FAILED
/<<PKGBUILDDIR>>/bundles/org.eclipse.swt/buildFragment.xml:88: The following error occurred while executing this line:
/<<PKGBUILDDIR>>/bundles/org.eclipse.swt/buildFragment.xml:61: Compile failed; see the compiler error output for details.

Total time: 11 seconds
make[1]: *** [debian/rules:30: override_dh_auto_build] Error 1
make[1]: Leaving directory '/<<PKGBUILDDIR>>'
make: *** [debian/rules:27: binary-arch] Error 2