Raspbian Package Auto-Building

Buildd status for selected packages (bullseye-staging)

Bugs

Package(s): Suite:
Compact mode Co-maintainers

Package armhf
Buildd exposure stats
✔ solvespaceInstalled
✔ chattyInstalled
✔ gduInstalled
✔ hubInstalled
✔ octave-iso2meshInstalled
✔ python-cassandra-driverInstalled
✔ dolfinInstalled
✔ fairy-stockfishBuild-Attempted
✔ garagemqBuild-Attempted
✔ golang-android-soongBuild-Attempted
✔ haskell-ormoluBuild-Attempted
✔ mojoshaderBuild-Attempted
✔ nixBuild-Attempted
✔ python-peachpyBuild-Attempted
✔ rpm2htmlBuild-Attempted
✔ ruby-cborBuild-Attempted
✔ rust-mysqlclient-sysBuild-Attempted
✔ scanbuttondBuild-Attempted
✔ tendermintBuild-Attempted
Package armhf
Buildd exposure stats
✔ agdaBuild-Attempted
✔ iem-plugin-suiteBuild-Attempted
✔ libgrokj2kBuild-Attempted
✔ wpewebkitInstalled

Tail of log for fairy-stockfish on armhf:

/usr/bin/ld: /usr/include/c++/10/bits/atomic_base.h:426: undefined reference to `__atomic_load_8'
/usr/bin/ld: /tmp/stockfish.NAs526.ltrans6.ltrans.o: in function `UCI::loop(int, char**)':
/usr/include/c++/10/bits/atomic_base.h:426: undefined reference to `__atomic_load_8'
/usr/bin/ld: /tmp/stockfish.NAs526.ltrans9.ltrans.o: in function `ThreadPool::start_thinking(Position&, std::unique_ptr<std::deque<StateInfo, std::allocator<StateInfo> >, std::default_delete<std::deque<StateInfo, std::allocator<StateInfo> > > >&, Search::LimitsType const&, bool) [clone .constprop.0]':
/usr/include/c++/10/bits/atomic_base.h:404: undefined reference to `__atomic_store_8'
/usr/bin/ld: /usr/include/c++/10/bits/atomic_base.h:404: undefined reference to `__atomic_store_8'
collect2: error: ld returned 1 exit status
make[3]: *** [Makefile:516: stockfish] Error 1
make[3]: Leaving directory '/<<PKGBUILDDIR>>/src'
make[2]: *** [Makefile:433: build] Error 2
make[2]: Leaving directory '/<<PKGBUILDDIR>>/src'
dh_auto_build: error: cd src && make -j4 build ARCH=general-32 returned exit code 2
make[1]: *** [debian/rules:105: override_dh_auto_build] Error 25
make[1]: Leaving directory '/<<PKGBUILDDIR>>'
make: *** [debian/rules:99: build-arch] Error 2

Tail of log for garagemq on armhf:

expvar
golang.org/x/net/trace
runtime/trace
net/http/pprof
encoding/xml
github.com/spf13/viper
github.com/valinurovam/garagemq/protocol
github.com/dgraph-io/badger/y
github.com/dgraph-io/badger/skl
github.com/dgraph-io/badger/table
github.com/dgraph-io/badger
# github.com/dgraph-io/badger
src/github.com/dgraph-io/badger/value.go:50:5: constant 4294967295 overflows int
dh_auto_build: error: cd obj-arm-linux-gnueabihf && go install -trimpath -v -p 4 github.com/valinurovam/garagemq github.com/valinurovam/garagemq/admin github.com/valinurovam/garagemq/amqp github.com/valinurovam/garagemq/auth github.com/valinurovam/garagemq/binding github.com/valinurovam/garagemq/config github.com/valinurovam/garagemq/consumer github.com/valinurovam/garagemq/exchange github.com/valinurovam/garagemq/interfaces github.com/valinurovam/garagemq/metrics github.com/valinurovam/garagemq/msgstorage github.com/valinurovam/garagemq/pool github.com/valinurovam/garagemq/protocol github.com/valinurovam/garagemq/qos github.com/valinurovam/garagemq/queue github.com/valinurovam/garagemq/safequeue github.com/valinurovam/garagemq/server github.com/valinurovam/garagemq/srvstorage github.com/valinurovam/garagemq/storage returned exit code 2
make: *** [debian/rules:4: build-arch] Error 25

Tail of log for golang-android-soong on armhf:

android/soong/partner/bpfix
android/soong/phony
android/soong/rust/config
android/soong/scripts
android/soong/symbol_inject/cmd
android/soong/xml
android/soong/zip/cmd
android/soong/sh
android/soong/rust
android/soong/java
android/soong/sysprop
android/soong/apex
android/soong/sdk
dh_auto_build: error: cd _build && go install -trimpath -v -p 4 android/soong android/soong/android android/soong/android/soongconfig android/soong/androidmk/androidmk android/soong/androidmk/cmd android/soong/androidmk/parser android/soong/apex android/soong/bpf android/soong/bpfix/bpfix android/soong/bpfix/cmd android/soong/bpfix/cmd_lib android/soong/cc android/soong/cc/config android/soong/cmd/dep_fixer android/soong/cmd/diff_target_files android/soong/cmd/extract_apks android/soong/cmd/extract_apks/bundle_proto android/soong/cmd/extract_jar_packages android/soong/cmd/extract_linker android/soong/cmd/fileslist android/soong/cmd/host_bionic_inject android/soong/cmd/javac_wrapper android/soong/cmd/merge_zips android/soong/cmd/multiproduct_kati android/soong/cmd/path_interposer android/soong/cmd/pom2bp android/soong/cmd/pom2mk android/soong/cmd/sbox android/soong/cmd/soong_build android/soong/cmd/soong_env android/soong/cmd/soong_ui android/soong/cmd/zip2zip android/soong/cmd/zipsync android/soong/cuj android/soong/dexpreopt android/soong/dexpreopt/dexpreopt_gen android/soong/env android/soong/etc android/soong/finder android/soong/finder/cmd android/soong/finder/fs android/soong/genrule android/soong/jar android/soong/java android/soong/java/config android/soong/makedeps android/soong/partner/androidmk android/soong/partner/bpfix android/soong/partner/bpfix/extensions android/soong/phony android/soong/python android/soong/remoteexec android/soong/rust android/soong/rust/config android/soong/scripts android/soong/sdk android/soong/sh android/soong/shared android/soong/symbol_inject android/soong/symbol_inject/cmd android/soong/sysprop android/soong/third_party/zip android/soong/tradefed android/soong/ui/build android/soong/ui/build/paths android/soong/ui/logger android/soong/ui/metrics android/soong/ui/metrics/metrics_proto android/soong/ui/metrics/upload_proto android/soong/ui/status android/soong/ui/status/build_error_proto android/soong/ui/status/build_progress_proto android/soong/ui/status/ninja_frontend android/soong/ui/terminal android/soong/ui/tracer android/soong/xml android/soong/zip android/soong/zip/cmd returned exit code 2
make: *** [debian/rules:6: binary-arch] Error 25

Tail of log for haskell-ormolu on armhf:

  tests/Ormolu/PrinterSpec.hs:25:25: 
  4) Ormolu.Printer module-header/leading-empty-line.hs works
       uncaught exception: IOException of type InvalidArgument
       data/examples/module-header/leading-empty-line.hs: hGetContents: invalid argument (invalid byte sequence)

  To rerun use: --match "/Ormolu.Printer/module-header/leading-empty-line.hs works/"

Randomized with seed 864557262

Finished in 2.1415 seconds
367 examples, 4 failures
Test suite tests: FAIL
Test suite logged to: dist-ghc/test/ormolu-0.1.2.0-tests.log
0 of 1 test suites (0 of 1 test cases) passed.
make: *** [/usr/share/cdbs/1/class/hlibrary.mk:154: check-ghc-stamp] Error 1

Tail of log for mojoshader on armhf:

[  6%] Built target lemon
make  -f CMakeFiles/mojoshader.dir/build.make CMakeFiles/mojoshader.dir/depend
make[3]: Entering directory '/<<BUILDDIR>>/mojoshader-0.0~hg1314+dfsg/obj-arm-linux-gnueabihf'
[  9%] Generating ../mojoshader_parser_hlsl.h
./lemon -q -T/<<BUILDDIR>>/mojoshader-0.0~hg1314+dfsg/misc/lempar.c /<<BUILDDIR>>/mojoshader-0.0~hg1314+dfsg/mojoshader_parser_hlsl.lemon
Segmentation fault (core dumped)
make[3]: *** [CMakeFiles/mojoshader.dir/build.make:86: ../mojoshader_parser_hlsl.h] Error 139
make[3]: *** Deleting file '../mojoshader_parser_hlsl.h'
make[3]: Leaving directory '/<<BUILDDIR>>/mojoshader-0.0~hg1314+dfsg/obj-arm-linux-gnueabihf'
make[2]: *** [CMakeFiles/Makefile2:139: CMakeFiles/mojoshader.dir/all] Error 2
make[2]: Leaving directory '/<<BUILDDIR>>/mojoshader-0.0~hg1314+dfsg/obj-arm-linux-gnueabihf'
make[1]: *** [Makefile:152: all] Error 2
make[1]: Leaving directory '/<<BUILDDIR>>/mojoshader-0.0~hg1314+dfsg/obj-arm-linux-gnueabihf'
dh_auto_build: error: cd obj-arm-linux-gnueabihf && make -j4 "INSTALL=install --strip-program=true" VERBOSE=1 returned exit code 2
make: *** [debian/rules:12: binary-arch] Error 25

Tail of log for nix on armhf:

/usr/include/c++/10/bits/vector.tcc:121:21: note: parameter passing for argument of type ‘__gnu_cxx::__normal_iterator<nlohmann::basic_json<>*, std::vector<nlohmann::basic_json<>, std::allocator<nlohmann::basic_json<> > > >’ changed in GCC 7.1
  121 |    _M_realloc_insert(end(), std::forward<_Args>(__args)...);
      |    ~~~~~~~~~~~~~~~~~^~~~~~~~~~~~~~~~~~~~~~~~~~~~~~~~~~~~~~~
/usr/include/c++/10/bits/vector.tcc:121:21: note: parameter passing for argument of type ‘__gnu_cxx::__normal_iterator<nlohmann::basic_json<>*, std::vector<nlohmann::basic_json<>, std::allocator<nlohmann::basic_json<> > > >’ changed in GCC 7.1
  121 |    _M_realloc_insert(end(), std::forward<_Args>(__args)...);
      |    ~~~~~~~~~~~~~~~~~^~~~~~~~~~~~~~~~~~~~~~~~~~~~~~~~~~~~~~~
g++ -std=c++17 -o /<<PKGBUILDDIR>>/src/libutil/libnixutil.so -shared -L/usr/lib/arm-linux-gnueabihf -Wl,-z,relro -Wl,-z,now -L/usr/lib/arm-linux-gnueabihf -Wl,-z,relro -Wl,-z,now -Wl,--no-copy-dt-needed-entries src/libutil/affinity.o src/libutil/archive.o src/libutil/args.o src/libutil/compression.o src/libutil/config.o src/libutil/hash.o src/libutil/json.o src/libutil/logging.o src/libutil/serialise.o src/libutil/thread-pool.o src/libutil/util.o src/libutil/xml-writer.o -llzma -lbz2 -pthread -lcrypto -lbrotlienc -lbrotlidec -L/usr/lib/arm-linux-gnueabihf -lboost_context -Wl,-z,defs -Wl,-soname=libnixutil.so   
/usr/bin/ld: src/libutil/logging.o: in function `std::__atomic_base<unsigned long long>::fetch_add(unsigned long long, std::memory_order)':
/usr/include/c++/10/bits/atomic_base.h:548: undefined reference to `__atomic_fetch_add_8'
collect2: error: ld returned 1 exit status
make[1]: *** [mk/lib.mk:104: src/libutil/libnixutil.so] Error 1
make[1]: *** Waiting for unfinished jobs....
make[1]: Leaving directory '/<<PKGBUILDDIR>>'
dh_auto_build: error: make -j4 returned exit code 2
make: *** [debian/rules:31: build-arch] Error 25

Tail of log for python-peachpy on armhf:

----------------------------------------------------------------------
Traceback (most recent call last):
  File "/<<PKGBUILDDIR>>/.pybuild/cpython3_3.9_peachpy/build/test/x86_64/test_load.py", line 28, in runTest
    py_multiply = asm_multiply.finalize(abi.detect()).encode().load()
  File "/<<PKGBUILDDIR>>/.pybuild/cpython3_3.9_peachpy/build/peachpy/x86_64/function.py", line 308, in finalize
    raise TypeError("%s is not an ABI object" % str(abi))
TypeError: None is not an ABI object

----------------------------------------------------------------------
Ran 1309 tests in 13.986s

FAILED (errors=1)
E: pybuild pybuild:353: test: plugin distutils failed with: exit code=1: cd '/<<PKGBUILDDIR>>/.pybuild/cpython3_3.9_peachpy/build'; python3.9 -m unittest discover -v 
dh_auto_test: error: pybuild --test -i python{version} -p 3.9 returned exit code 13
make: *** [debian/rules:8: binary-arch] Error 25

Tail of log for rpm2html on armhf:

  758 |              headerNextIterator(sIter, &tag, &type, (void *) &p, &count);) {
      |              ^~~~~~~~~~~~~~~~~~
      |              headerInitIterator
rpmopen.c: In function 'rpmOpen':
rpmopen.c:1052:20: error: storage size of 'lead' isn't known
 1052 |     struct rpmlead lead;
      |                    ^~~~
rpmopen.c:1140:9: warning: implicit declaration of function 'fdClose'; did you mean 'fclose'? [-Wimplicit-function-declaration]
 1140 |         fdClose(fd);
      |         ^~~~~~~
      |         fclose
make[1]: *** [Makefile:516: rpmopen.o] Error 1
make[1]: Leaving directory '/<<PKGBUILDDIR>>'
dh_auto_build: error: make -j1 returned exit code 2
make: *** [debian/rules:7: build-arch] Error 25

Tail of log for ruby-cbor on armhf:

     # ./spec/format_spec.rb:503:in `to_cbor'
     # ./spec/format_spec.rb:503:in `check'
     # ./spec/format_spec.rb:383:in `block (2 levels) in <top (required)>'

Finished in 38.35 seconds (files took 1.31 seconds to load)
160 examples, 1 failure

Failed examples:

rspec ./spec/format_spec.rb:378 # CBOR Tagged

/usr/bin/ruby2.7 -I/usr/share/rubygems-integration/all/gems/rspec-support-3.9.3/lib:/usr/share/rubygems-integration/all/gems/rspec-core-3.9.2/lib /usr/share/rubygems-integration/all/gems/rspec-core-3.9.2/exe/rspec --pattern ./spec/\*\*/\*_spec.rb --format documentation failed
ERROR: Test "ruby2.7" failed. Exiting.
dh_auto_install: error: dh_ruby --install /<<PKGBUILDDIR>>/debian/ruby-cbor returned exit code 1
make: *** [debian/rules:7: binary-arch] Error 25

Tail of log for rust-mysqlclient-sys on armhf:

    bindgen_test_layout_st_mysql_res
    bindgen_test_layout_st_mysql_rows
    bindgen_test_layout_st_mysql_stmt
    bindgen_test_layout_st_mysql_time
    bindgen_test_layout_st_net
    bindgen_test_layout_st_plugin_vio
    bindgen_test_layout_st_used_mem

test result: FAILED. 2 passed; 16 failed; 0 ignored; 0 measured; 0 filtered out

error: test failed, to rerun pass '--lib'
dh_auto_test: error: /usr/share/cargo/bin/cargo test --all returned exit code 101
make[1]: *** [debian/rules:6: override_dh_auto_test] Error 25
make[1]: Leaving directory '/<<PKGBUILDDIR>>'
make: *** [debian/rules:3: build-arch] Error 2

Tail of log for scanbuttond on armhf:

dpkg-buildpackage: info: source package scanbuttond
dpkg-buildpackage: info: source version 0.2.3.cvs20090713-16
dpkg-buildpackage: info: source distribution unstable
 dpkg-source --before-build .
dpkg-buildpackage: info: host architecture armhf
 fakeroot debian/rules clean
dh_testdir
set -e; for f in include/scanbuttond/config.h.in INSTALL; do cp "$f" "$f.upstream"; done
if [ -f /usr/share/libtool/config/ltmain.sh ]; then \
  cp /usr/share/libtool/config/ltmain.sh .; \
else \
  cp /usr/share/libtool/ltmain.sh .; \
fi
cp: cannot stat '/usr/share/libtool/ltmain.sh': No such file or directory
make: *** [debian/rules:45: configure-stamp] Error 1

Tail of log for tendermint on armhf:

--- PASS: TestBadVotes (0.05s)
=== RUN   TestConflicts
--- PASS: TestConflicts (0.07s)
=== RUN   TestMakeCommit
--- PASS: TestMakeCommit (0.09s)
=== RUN   TestVoteSignable
--- PASS: TestVoteSignable (0.00s)
PASS
ok  	github.com/tendermint/tendermint/types	7.581s
?   	github.com/tendermint/tendermint/version	[no test files]
FAIL
dh_auto_test: error: cd obj-arm-linux-gnueabihf && go test -vet=off -v -p 1 github.com/tendermint/tendermint/benchmarks github.com/tendermint/tendermint/benchmarks/proto github.com/tendermint/tendermint/benchmarks/simu github.com/tendermint/tendermint/blockchain github.com/tendermint/tendermint/cmd/tendermint github.com/tendermint/tendermint/config/tendermint github.com/tendermint/tendermint/config/tendermint_test github.com/tendermint/tendermint/consensus github.com/tendermint/tendermint/fail-test github.com/tendermint/tendermint/mempool github.com/tendermint/tendermint/node github.com/tendermint/tendermint/proxy github.com/tendermint/tendermint/rpc/core github.com/tendermint/tendermint/rpc/core/types github.com/tendermint/tendermint/rpc/grpc github.com/tendermint/tendermint/rpc/test github.com/tendermint/tendermint/state github.com/tendermint/tendermint/test/app github.com/tendermint/tendermint/types github.com/tendermint/tendermint/version returned exit code 1
make[1]: *** [debian/rules:9: override_dh_auto_test] Error 25
make[1]: Leaving directory '/<<BUILDDIR>>/tendermint-0.8.0+git20170113.0.764091d'
make: *** [debian/rules:6: build-arch] Error 2

Tail of log for agda on armhf:

[229 of 369] Compiling Agda.TypeChecking.Serialise.Instances ( src/full/Agda/TypeChecking/Serialise/Instances.hs, dist-ghc/build/Agda/TypeChecking/Serialise/Instances.o )
[230 of 369] Compiling Agda.TypeChecking.Serialise ( src/full/Agda/TypeChecking/Serialise.hs, dist-ghc/build/Agda/TypeChecking/Serialise.o )
[231 of 369] Compiling Agda.TypeChecking.Rules.Def[boot] ( src/full/Agda/TypeChecking/Rules/Def.hs-boot, dist-ghc/build/Agda/TypeChecking/Rules/Def.o-boot )
[232 of 369] Compiling Agda.TypeChecking.Rules.Builtin.Coinduction[boot] ( src/full/Agda/TypeChecking/Rules/Builtin/Coinduction.hs-boot, dist-ghc/build/Agda/TypeChecking/Rules/Builtin/Coinduction.o-boot )
[233 of 369] Compiling Agda.TypeChecking.Rewriting.Clause ( src/full/Agda/TypeChecking/Rewriting/Clause.hs, dist-ghc/build/Agda/TypeChecking/Rewriting/Clause.o )
[234 of 369] Compiling Agda.TypeChecking.Reduce.Monad ( src/full/Agda/TypeChecking/Reduce/Monad.hs, dist-ghc/build/Agda/TypeChecking/Reduce/Monad.o )
[235 of 369] Compiling Agda.TypeChecking.Records[boot] ( src/full/Agda/TypeChecking/Records.hs-boot, dist-ghc/build/Agda/TypeChecking/Records.o-boot )
[236 of 369] Compiling Agda.TypeChecking.Patterns.Match[boot] ( src/full/Agda/TypeChecking/Patterns/Match.hs-boot, dist-ghc/build/Agda/TypeChecking/Patterns/Match.o-boot )
[237 of 369] Compiling Agda.TypeChecking.Patterns.Abstract ( src/full/Agda/TypeChecking/Patterns/Abstract.hs, dist-ghc/build/Agda/TypeChecking/Patterns/Abstract.o )
[238 of 369] Compiling Agda.TypeChecking.Names ( src/full/Agda/TypeChecking/Names.hs, dist-ghc/build/Agda/TypeChecking/Names.o )
[239 of 369] Compiling Agda.TypeChecking.MetaVars.Mention ( src/full/Agda/TypeChecking/MetaVars/Mention.hs, dist-ghc/build/Agda/TypeChecking/MetaVars/Mention.o )
[240 of 369] Compiling Agda.TypeChecking.EtaContract ( src/full/Agda/TypeChecking/EtaContract.hs, dist-ghc/build/Agda/TypeChecking/EtaContract.o )
[241 of 369] Compiling Agda.TypeChecking.Reduce ( src/full/Agda/TypeChecking/Reduce.hs, dist-ghc/build/Agda/TypeChecking/Reduce.o )
ghc: out of memory (requested 1048576 bytes)
make: *** [/usr/share/cdbs/1/class/hlibrary.mk:147: build-ghc-stamp] Error 251

Tail of log for iem-plugin-suite on armhf:

                 from ../../JuceLibraryCode/../JuceLibraryCode/JuceHeader.h:17,
                 from ../../../resources/Standalone/StandaloneApp.cpp:53:
/usr/share/juce/modules/juce_core/memory/juce_Atomic.h: In instantiation of ‘juce::Atomic<Type>::~Atomic() [with Type = bool]’:
../../JuceLibraryCode/../Source/../../resources/OSC/OSCUtilities.h:33:5:   required from here
/usr/share/juce/modules/juce_core/memory/juce_Atomic.h:58:43: error: static assertion failed: This class can only be used for lock-free types
   58 |         static_assert (std::atomic<Type>::is_always_lock_free,
      |                                           ^~~~~~~~~~~~~~~~~~~
make[3]: *** [Makefile:179: build/intermediate/Release/StandaloneApp_2a979640.o] Error 1
make[3]: Leaving directory '/<<PKGBUILDDIR>>/RoomEncoder/Builds/LinuxMakefile'
make[2]: *** [Makefile:125: RoomEncoder-LinuxMakefile-build] Error 2
make[2]: Leaving directory '/<<PKGBUILDDIR>>'
dh_auto_build: error: make -j1 "INSTALL=install --strip-program=true" returned exit code 2
make[1]: *** [debian/rules:42: override_dh_auto_build] Error 25
make[1]: Leaving directory '/<<PKGBUILDDIR>>'
make: *** [debian/rules:39: binary-arch] Error 2

Tail of log for libgrokj2k on armhf:

make[3]: Leaving directory '/<<PKGBUILDDIR>>/obj-arm-linux-gnueabihf'
make[2]: *** [CMakeFiles/Makefile2:342: src/bin/jp2/CMakeFiles/grk_compress.dir/all] Error 2
[100%] Linking CXX executable ../../../bin/grk_dump
cd /<<PKGBUILDDIR>>/obj-arm-linux-gnueabihf/src/bin/jp2 && /usr/bin/cmake -E cmake_link_script CMakeFiles/grk_dump.dir/link.txt --verbose=1
/usr/bin/c++ -g -O2 -ffile-prefix-map=/<<PKGBUILDDIR>>=. -fstack-protector-strong -Wformat -Werror=format-security -fvisibility=hidden -Wdate-time -D_FORTIFY_SOURCE=2 -Wl,-z,relro -Wl,-z,now CMakeFiles/grk_dump.dir/grk_dump.cpp.o CMakeFiles/grk_dump.dir/__/common/convert.cpp.o CMakeFiles/grk_dump.dir/__/image_format/ImageFormat.cpp.o CMakeFiles/grk_dump.dir/__/image_format/FileStreamIO.cpp.o CMakeFiles/grk_dump.dir/__/image_format/PNMFormat.cpp.o CMakeFiles/grk_dump.dir/__/image_format/PGXFormat.cpp.o CMakeFiles/grk_dump.dir/__/image_format/BMPFormat.cpp.o CMakeFiles/grk_dump.dir/__/image_format/RAWFormat.cpp.o CMakeFiles/grk_dump.dir/__/common/color.cpp.o CMakeFiles/grk_dump.dir/__/common/common.cpp.o CMakeFiles/grk_dump.dir/__/common/exif.cpp.o CMakeFiles/grk_dump.dir/__/common/spdlog/spdlog.cpp.o CMakeFiles/grk_dump.dir/__/common/spdlog/color_sinks.cpp.o CMakeFiles/grk_dump.dir/__/common/spdlog/stdout_sinks.cpp.o CMakeFiles/grk_dump.dir/__/common/spdlog/fmt.cpp.o CMakeFiles/grk_dump.dir/__/common/spdlog/async.cpp.o CMakeFiles/grk_dump.dir/__/common/spdlog/file_sinks.cpp.o CMakeFiles/grk_dump.dir/__/image_format/TIFFFormat.cpp.o CMakeFiles/grk_dump.dir/__/image_format/PNGFormat.cpp.o CMakeFiles/grk_dump.dir/__/image_format/JPEGFormat.cpp.o CMakeFiles/grk_dump.dir/__/image_format/iccjpeg.c.o -o ../../../bin/grk_dump  ../../../bin/libgrokj2k.so.7.6.6 /usr/lib/arm-linux-gnueabihf/libpng.so /usr/lib/arm-linux-gnueabihf/libz.so /usr/lib/arm-linux-gnueabihf/libtiff.so /usr/lib/arm-linux-gnueabihf/liblcms2.so /usr/lib/arm-linux-gnueabihf/libjpeg.so -ldl /usr/lib/arm-linux-gnueabihf/libz.so /usr/lib/arm-linux-gnueabihf/libperl.so.5.32 -lcrypt -lpthread /usr/lib/arm-linux-gnueabihf/libtiff.so /usr/lib/arm-linux-gnueabihf/liblcms2.so /usr/lib/arm-linux-gnueabihf/libjpeg.so -ldl /usr/lib/arm-linux-gnueabihf/libperl.so.5.32 -lcrypt 
/usr/bin/ld: ../../../bin/libgrokj2k.so.7.6.6: undefined reference to `__atomic_fetch_add_8'
collect2: error: ld returned 1 exit status
make[3]: *** [src/bin/jp2/CMakeFiles/grk_dump.dir/build.make:418: bin/grk_dump] Error 1
make[3]: Leaving directory '/<<PKGBUILDDIR>>/obj-arm-linux-gnueabihf'
make[2]: *** [CMakeFiles/Makefile2:315: src/bin/jp2/CMakeFiles/grk_dump.dir/all] Error 2
make[2]: Leaving directory '/<<PKGBUILDDIR>>/obj-arm-linux-gnueabihf'
make[1]: *** [Makefile:174: all] Error 2
make[1]: Leaving directory '/<<PKGBUILDDIR>>/obj-arm-linux-gnueabihf'
dh_auto_build: error: cd obj-arm-linux-gnueabihf && make -j4 "INSTALL=install --strip-program=true" VERBOSE=1 returned exit code 2
make: *** [debian/rules:14: binary-arch] Error 25