Raspbian Package Auto-Building

Buildd status for siconos (bullseye-staging)

Debian PTSTrackerChangelogBugspackages.d.obuildd.d.o

Package(s): Suite:
Compact mode Co-maintainers

ArchitectureVersionStatusForBuilddStateMiscLogs
Buildd exposure stats armhf  4.3.1+dfsg-2Build-Attempted7d 12h 1mbm-wb-04uncompiledmisc:extraold | all (3)

Tail of log for siconos on armhf:

 6518 |     npy_intp this_vector_dim[1] = { v.size() };
      |                                     ~~~~~~^~
/<<BUILDDIR>>/siconos-4.3.1+dfsg/obj-arm-linux-gnueabihf/wrap/siconos/kernelPYTHON_wrap.cxx: In function 'PyObject* SP_SiconosVector_to_numpy(SP::SiconosVector)':
/<<BUILDDIR>>/siconos-4.3.1+dfsg/obj-arm-linux-gnueabihf/wrap/siconos/kernelPYTHON_wrap.cxx:6528:44: warning: narrowing conversion of '((std::__shared_ptr_access<SiconosVector, __gnu_cxx::_S_mutex, false, false>*)(& v))->std::__shared_ptr_access<SiconosVector, __gnu_cxx::_S_mutex, false, false>::operator->()->SiconosVector::size()' from 'unsigned int' to 'npy_intp' {aka 'int'} [-Wnarrowing]
 6528 |     npy_intp this_vector_dim[1] = { v->size() };
      |                                     ~~~~~~~^~
virtual memory exhausted: Cannot allocate memory
make[3]: *** [kernel/swig/CMakeFiles/_kernel.dir/build.make:85: kernel/swig/CMakeFiles/_kernel.dir/__/__/wrap/siconos/kernelPYTHON_wrap.cxx.o] Error 1
make[3]: Leaving directory '/<<BUILDDIR>>/siconos-4.3.1+dfsg/obj-arm-linux-gnueabihf'
make[2]: *** [CMakeFiles/Makefile2:6035: kernel/swig/CMakeFiles/_kernel.dir/all] Error 2
make[2]: Leaving directory '/<<BUILDDIR>>/siconos-4.3.1+dfsg/obj-arm-linux-gnueabihf'
make[1]: *** [Makefile:163: all] Error 2
make[1]: Leaving directory '/<<BUILDDIR>>/siconos-4.3.1+dfsg/obj-arm-linux-gnueabihf'
dh_auto_build: error: cd obj-arm-linux-gnueabihf && make -j1 "INSTALL=install --strip-program=true" VERBOSE=1 returned exit code 2
make: *** [debian/rules:49: binary-arch] Error 25