Raspbian Package Auto-Building

Buildd status for scli (wheezy-staging)

Debian PTS – Tracker – Changelog – Bugs – packages.d.o – buildd.d.o

Package(s): Suite:
Compact mode Co-maintainers

ArchitectureVersionStatusForBuilddStateMiscLogs
Buildd exposure stats armhf  ↓0.4.0-2Build-Attempted3386d 7hbm-wb-02uncompilednet:sourceold | all (5)

Tail of log for scli on armhf:

gcc -DHAVE_CONFIG_H -I. -I. -I..  -I../stub -I../proc -pthread -I/usr/include/glib-2.0 -I/usr/lib/arm-linux-gnueabihf/glib-2.0/include -I/usr/include/gsnmp -I/usr/include/gnet-2.0 -I/usr/lib/gnet-2.0/include/   -pthread -I/usr/include/glib-2.0 -I/usr/lib/arm-linux-gnueabihf/glib-2.0/include -I/usr/include/gnet-2.0 -I/usr/lib/gnet-2.0/include/     -I/usr/include/libxml2   -g -O2 -c 3com.c
gcc -DHAVE_CONFIG_H -I. -I. -I..  -I../stub -I../proc -pthread -I/usr/include/glib-2.0 -I/usr/lib/arm-linux-gnueabihf/glib-2.0/include -I/usr/include/gsnmp -I/usr/include/gnet-2.0 -I/usr/lib/gnet-2.0/include/   -pthread -I/usr/include/glib-2.0 -I/usr/lib/arm-linux-gnueabihf/glib-2.0/include -I/usr/include/gnet-2.0 -I/usr/lib/gnet-2.0/include/     -I/usr/include/libxml2   -g -O2 -c hp.c
gcc -DHAVE_CONFIG_H -I. -I. -I..  -I../stub -I../proc -pthread -I/usr/include/glib-2.0 -I/usr/lib/arm-linux-gnueabihf/glib-2.0/include -I/usr/include/gsnmp -I/usr/include/gnet-2.0 -I/usr/lib/gnet-2.0/include/   -pthread -I/usr/include/glib-2.0 -I/usr/lib/arm-linux-gnueabihf/glib-2.0/include -I/usr/include/gnet-2.0 -I/usr/lib/gnet-2.0/include/     -I/usr/include/libxml2   -g -O2 -c sflow.c
gcc  -g -O2   -o scli  scli.o vendors.o basic.o monitor.o cmds.o thread.o fmt.o xml.o netconf.o system.o entity.o interface.o disman.o snmp.o ip.o udp.o tcp.o bridge.o atm.o ether.o ospf.o printer.o isdn.o rs232.o sonet.o cisco.o nortel.o netsnmp.o 3com.o hp.o sflow.o ../proc/libproc.a ../stub/libstub.a -lgsnmp -lgnet-2.0   -lgnet-2.0   -Wl,--export-dynamic -pthread -lgmodule-2.0 -lrt -lglib-2.0   -L/usr/lib -lxml2 -lreadline -lncurses 
scli.o: In function `main':
/<<PKGBUILDDIR>>/scli/scli.c:383: undefined reference to `g_thread_init'
collect2: ld returned 1 exit status
make[3]: *** [scli] Error 1
make[3]: Leaving directory `/<<PKGBUILDDIR>>/scli'
make[2]: *** [all-recursive] Error 1
make[2]: Leaving directory `/<<PKGBUILDDIR>>'
make[1]: *** [all] Error 2
make[1]: Leaving directory `/<<PKGBUILDDIR>>'
dh_auto_build: make -j1 returned exit code 2
make: *** [build-arch] Error 2