Raspbian Package Auto-Building

Buildd status for sagemath (bullseye-staging)

Debian PTSTrackerChangelogBugspackages.d.obuildd.d.o

Package(s): Suite:
Compact mode Co-maintainers

ArchitectureVersionStatusForBuilddStateMiscLogs
Buildd exposure stats armhf  9.2-2Build-Attempted1163d 13h 15mmb-lxc-01uncompiledmisc:sourceold | all (8)

Tail of log for sagemath on armhf:

  File "/usr/lib/python3.9/multiprocessing/heap.py", line 95, in _choose_dir
    st = os.statvfs(d)
FileNotFoundError: [Errno 2] No such file or directory: '/dev/shm'
make[2]: Entering directory '/<<PKGBUILDDIR>>'
Error: log file sage/logs/ptestlong-arch.log not found
make[2]: *** [debian/rules:164: had-few-failures] Error 1
make[2]: Leaving directory '/<<PKGBUILDDIR>>'
make[2]: Entering directory '/<<PKGBUILDDIR>>'
Checking number of failed tests to determine whether to rerun tests in series...
Error: log file sage/logs/ptestlong-arch.log not found
make[2]: *** [debian/rules:177: had-not-too-many-failures] Error 1
make[2]: Leaving directory '/<<PKGBUILDDIR>>'
make[1]: *** [debian/rules:202: override_dh_auto_test-arch] Error 2
make[1]: Leaving directory '/<<PKGBUILDDIR>>'
make: *** [debian/rules:40: binary-arch] Error 2