Raspbian Package Auto-Building

Buildd status for rust-servo-freetype-sys (bullseye-staging)

Debian PTSTrackerChangelogBugspackages.d.obuildd.d.o

Package(s): Suite:
Compact mode Co-maintainers

ArchitectureVersionStatusForBuilddStateMiscLogs
Buildd exposure stats armhf  4.0.5-2Build-Attempted1d 22h 20mtest2019uncompiledmisc:sourceold | all (9)

Tail of log for rust-servo-freetype-sys on armhf:

     2: cmake::fail
               at ./debian/cargo_registry/cmake-0.1.44/src/lib.rs:885
     3: cmake::run
               at ./debian/cargo_registry/cmake-0.1.44/src/lib.rs:863
     4: cmake::Config::build
               at ./debian/cargo_registry/cmake-0.1.44/src/lib.rs:698
     5: build_script_build::main
               at ./build.rs:23
     6: core::ops::function::FnOnce::call_once
               at /usr/src/rustc-1.48.0/library/core/src/ops/function.rs:227
  note: Some details are omitted, run with `RUST_BACKTRACE=full` for a verbose backtrace.
dh_auto_test: error: /usr/share/cargo/bin/cargo test --all returned exit code 101
make[1]: *** [debian/rules:6: override_dh_auto_test] Error 25
make[1]: Leaving directory '/<<PKGBUILDDIR>>'
make: *** [debian/rules:3: build-arch] Error 2