Raspbian Package Auto-Building

Buildd status for rust-generator (bookworm-staging)

Debian PTSTrackerChangelogBugspackages.d.obuildd.d.o

Package(s): Suite:
Compact mode Co-maintainers

ArchitectureVersionStatusForBuilddStateMiscLogs
Buildd exposure stats armhf  0.6.20-2Build-Attempted28d 23h 57mtest2019uncompiledmisc:sourceold | all (3)

Tail of log for rust-generator on armhf:

  thread 'main' panicked at 'Unsupported architecture: arm-unknown-linux-gnueabihf', build.rs:30:13
  stack backtrace:
     0: rust_begin_unwind
               at /usr/src/rustc-1.49.0/library/std/src/panicking.rs:495:5
     1: std::panicking::begin_panic_fmt
               at /usr/src/rustc-1.49.0/library/std/src/panicking.rs:437:5
     2: build_script_build::main
               at ./build.rs:30:13
     3: core::ops::function::FnOnce::call_once
               at /usr/src/rustc-1.49.0/library/core/src/ops/function.rs:227:5
  note: Some details are omitted, run with `RUST_BACKTRACE=full` for a verbose backtrace.
dh_auto_test: error: /usr/share/cargo/bin/cargo test --all returned exit code 101
make[1]: *** [debian/rules:6: override_dh_auto_test] Error 25
make[1]: Leaving directory '/<<PKGBUILDDIR>>'
make: *** [debian/rules:3: build-arch] Error 2