Raspbian Package Auto-Building

Buildd status for rocksdb (bullseye-staging)

Debian PTSTrackerChangelogBugspackages.d.obuildd.d.o

Package(s): Suite:
Compact mode Co-maintainers

ArchitectureVersionStatusForBuilddStateMiscLogs
Buildd exposure stats armhf  6.11.4-3Build-Attempted10d 3h 43mmb-lxc-02uncompiledmisc:optionalold | all (4)

Tail of log for rocksdb on armhf:

/usr/include/c++/10/bits/vector.tcc: In member function 'void std::vector<_Tp, _Alloc>::_M_realloc_insert(std::vector<_Tp, _Alloc>::iterator, _Args&& ...) [with _Args = {rocksdb::DBOptions, rocksdb::ColumnFamilyOptions&}; _Tp = rocksdb::Options; _Alloc = std::allocator<rocksdb::Options>]':
/usr/include/c++/10/bits/vector.tcc:426:7: note: parameter passing for argument of type 'std::vector<rocksdb::Options>::iterator' changed in GCC 7.1
/usr/include/c++/10/bits/vector.tcc: In member function 'void std::vector<_Tp, _Alloc>::emplace_back(_Args&& ...) [with _Args = {rocksdb::DBOptions, rocksdb::ColumnFamilyOptions&}; _Tp = rocksdb::Options; _Alloc = std::allocator<rocksdb::Options>]':
/usr/include/c++/10/bits/vector.tcc:121:21: note: parameter passing for argument of type '__gnu_cxx::__normal_iterator<rocksdb::Options*, std::vector<rocksdb::Options> >' changed in GCC 7.1
  121 |    _M_realloc_insert(end(), std::forward<_Args>(__args)...);
      |    ~~~~~~~~~~~~~~~~~^~~~~~~~~~~~~~~~~~~~~~~~~~~~~~~~~~~~~~~
/usr/include/c++/10/bits/vector.tcc: In member function 'virtual void rocksdb::DBCompactionTestWithParam_LevelCompactionCFPathUse_Test::TestBody()':
/usr/include/c++/10/bits/vector.tcc:121:21: note: parameter passing for argument of type '__gnu_cxx::__normal_iterator<rocksdb::Options*, std::vector<rocksdb::Options> >' changed in GCC 7.1
  121 |    _M_realloc_insert(end(), std::forward<_Args>(__args)...);
      |    ~~~~~~~~~~~~~~~~~^~~~~~~~~~~~~~~~~~~~~~~~~~~~~~~~~~~~~~~
make[2]: Leaving directory '/<<PKGBUILDDIR>>'
dh_auto_build: error: make -j4 "INSTALL=install --strip-program=true" all returned exit code 2
make[1]: *** [debian/rules:19: override_dh_auto_build] Error 25
make[1]: Leaving directory '/<<PKGBUILDDIR>>'
make: *** [debian/rules:29: build-arch] Error 2