Raspbian Package Auto-Building

Buildd status for rapmap (bookworm-staging)

Debian PTSTrackerChangelogBugspackages.d.obuildd.d.o

Package(s): Suite:
Compact mode Co-maintainers

ArchitectureVersionStatusForBuilddStateMiscLogs
Buildd exposure stats armhf  0.15.0+dfsg-2Build-Attempted66d 4h 9mmb-lxc-01uncompiledmisc:optionalold | all (3)

Tail of log for rapmap on armhf:

At global scope:
cc1plus: note: unrecognized command-line option ‘-Wno-unused-local-typedef’ may have been intended to silence earlier diagnostics
make[4]: *** [src/CMakeFiles/rapmap.dir/build.make:121: src/CMakeFiles/rapmap.dir/RapMapSAMapper.cpp.o] Error 1
At global scope:
cc1plus: note: unrecognized command-line option ‘-Wno-unused-local-typedef’ may have been intended to silence earlier diagnostics
make[4]: *** [src/CMakeFiles/rapmap.dir/build.make:93: src/CMakeFiles/rapmap.dir/RapMapSAIndexer.cpp.o] Error 1
make[4]: Leaving directory '/<<PKGBUILDDIR>>/obj-arm-linux-gnueabihf'
make[3]: *** [CMakeFiles/Makefile2:134: src/CMakeFiles/rapmap.dir/all] Error 2
make[3]: Leaving directory '/<<PKGBUILDDIR>>/obj-arm-linux-gnueabihf'
make[2]: *** [Makefile:169: all] Error 2
make[2]: Leaving directory '/<<PKGBUILDDIR>>/obj-arm-linux-gnueabihf'
dh_auto_build: error: cd obj-arm-linux-gnueabihf && make -j4 "INSTALL=install --strip-program=true" VERBOSE=1 returned exit code 2
make[1]: *** [debian/rules:22: override_dh_auto_build] Error 25
make[1]: Leaving directory '/<<PKGBUILDDIR>>'
make: *** [debian/rules:16: binary-arch] Error 2