Raspbian Package Auto-Building

Buildd status for r-cran-s2 (bullseye-staging)

Debian PTSTrackerChangelogBugspackages.d.obuildd.d.o

Package(s): Suite:
Compact mode Co-maintainers

ArchitectureVersionStatusForBuilddStateMiscLogs
Buildd exposure stats armhf  1.0.4-1Build-Attempted1d 23h 25mmb-lxc-02uncompiledmisc:extraold | all (4)

Tail of log for r-cran-s2 on armhf:

      |                                                    ^~
In file included from /usr/include/openssl/bn.h:19,
                 from ../inst/include/s2/util/math/exactfloat/exactfloat.h:119,
                 from s2/util/math/exactfloat/exactfloat.cc:18:
/usr/include/openssl/ossl_typ.h:80:16: note: forward declaration of 'BIGNUM' {aka 'struct bignum_st'}
   80 | typedef struct bignum_st BIGNUM;
      |                ^~~~~~~~~
make[1]: *** [/usr/lib/R/etc/Makeconf:179: s2/util/math/exactfloat/exactfloat.o] Error 1
make[1]: Leaving directory '/<<PKGBUILDDIR>>/src'
make[1]: Entering directory '/<<PKGBUILDDIR>>/src'
make[1]: Leaving directory '/<<PKGBUILDDIR>>/src'
ERROR: compilation failed for package 's2'
* removing '/<<PKGBUILDDIR>>/debian/r-cran-s2/usr/lib/R/site-library/s2'
dh_auto_install: error: R CMD INSTALL -l /<<PKGBUILDDIR>>/debian/r-cran-s2/usr/lib/R/site-library --clean . "--built-timestamp='Sat, 16 Jan 2021 17:30:37 +0100'" returned exit code 1
make: *** [debian/rules:4: binary-arch] Error 25