Raspbian Package Auto-Building

Buildd status for r-bioc-rsubread (bullseye-staging)

Debian PTSTrackerChangelogBugspackages.d.obuildd.d.o

Package(s): Suite:
Compact mode Co-maintainers

ArchitectureVersionStatusForBuilddStateMiscLogs
Buildd exposure stats armhf  2.4.2-1Build-Attempted1d 18mtest2019uncompiledmisc:extraold | all (5)

Tail of log for r-bioc-rsubread on armhf:

/usr/include/stdint.h:96:23: error: conflicting types for ‘uintptr_t’
   96 | typedef unsigned int  uintptr_t;
      |                       ^~~~~~~~~
In file included from R_wrapper.c:30:
/usr/share/R/include/Rinterface.h:110:24: note: previous declaration of ‘uintptr_t’ was here
  110 |  typedef unsigned long uintptr_t;
      |                        ^~~~~~~~~
make[1]: *** [/usr/lib/R/etc/Makeconf:172: R_wrapper.o] Error 1
make[1]: Leaving directory '/<<PKGBUILDDIR>>/src'
make[1]: Entering directory '/<<PKGBUILDDIR>>/src'
make[1]: Leaving directory '/<<PKGBUILDDIR>>/src'
ERROR: compilation failed for package ‘Rsubread’
* removing ‘/<<PKGBUILDDIR>>/debian/r-bioc-rsubread/usr/lib/R/site-library/Rsubread’
dh_auto_install: error: R CMD INSTALL -l /<<PKGBUILDDIR>>/debian/r-bioc-rsubread/usr/lib/R/site-library --clean . "--built-timestamp='Fri, 27 Nov 2020 11:36:46 +0100'" returned exit code 1
make: *** [debian/rules:4: binary-arch] Error 25