Raspbian Package Auto-Building

Buildd status for qstopmotion (stretch-staging)

Debian PTSTrackerChangelogBugspackages.d.obuildd.d.o

Package(s): Suite:
Compact mode Co-maintainers

ArchitectureVersionStatusForBuilddStateMiscLogs
Buildd exposure stats armhf  2.3.2-1Build-Attempted2172d 23h 33mbm-wb-02uncompiledmisc:sourceold | all (4)

Tail of log for qstopmotion on armhf:

[ 97%] Building CXX object CMakeFiles/qstopmotion.dir/src/technical/grabber/video4linux2/v4l2grabber.cpp.o
/usr/bin/c++   -DQT_CORE_LIB -DQT_GUI_LIB -DQT_NO_DEBUG -DQT_WIDGETS_LIB -DQT_XML_LIB -I/<<PKGBUILDDIR>>/obj-arm-linux-gnueabihf -I/<<PKGBUILDDIR>> -I/<<PKGBUILDDIR>>/src -isystem /usr/include/arm-linux-gnueabihf/qt5 -isystem /usr/include/arm-linux-gnueabihf/qt5/QtCore -isystem /usr/lib/arm-linux-gnueabihf/qt5/mkspecs/linux-g++ -isystem /usr/include/arm-linux-gnueabihf/qt5/QtGui -isystem /usr/include/arm-linux-gnueabihf/qt5/QtWidgets -isystem /usr/include/arm-linux-gnueabihf/qt5/QtXml  -g -O2 -fdebug-prefix-map=/<<PKGBUILDDIR>>=. -fstack-protector-strong -Wformat -Werror=format-security -Wdate-time -D_FORTIFY_SOURCE=2   -fPIC -std=gnu++11 -o CMakeFiles/qstopmotion.dir/src/technical/grabber/video4linux2/v4l2grabber.cpp.o -c /<<PKGBUILDDIR>>/src/technical/grabber/video4linux2/v4l2grabber.cpp
CMakeFiles/qstopmotion.dir/build.make:1817: recipe for target 'CMakeFiles/qstopmotion.dir/src/technical/grabber/gphoto2/gpgrabber.cpp.o' failed
make[3]: *** [CMakeFiles/qstopmotion.dir/src/technical/grabber/gphoto2/gpgrabber.cpp.o] Error 1
make[3]: *** Waiting for unfinished jobs....
make[3]: Leaving directory '/<<PKGBUILDDIR>>/obj-arm-linux-gnueabihf'
CMakeFiles/Makefile2:70: recipe for target 'CMakeFiles/qstopmotion.dir/all' failed
make[2]: *** [CMakeFiles/qstopmotion.dir/all] Error 2
make[2]: Leaving directory '/<<PKGBUILDDIR>>/obj-arm-linux-gnueabihf'
Makefile:152: recipe for target 'all' failed
make[1]: *** [all] Error 2
make[1]: Leaving directory '/<<PKGBUILDDIR>>/obj-arm-linux-gnueabihf'
dh_auto_build: make -j4 returned exit code 2
debian/rules:16: recipe for target 'build-arch' failed
make: *** [build-arch] Error 2