Raspbian Package Auto-Building

Buildd status for selected packages (bullseye-staging)

Bugs

Package(s): Suite:
Compact mode Co-maintainers

Package armhf
Buildd exposure stats
✔ python-skbioBuild-Attempted
✔ spadesBuild-Attempted
✔ tensorpipeBuild-Attempted
✔ apfBuild-Attempted
✔ bcachefs-toolsBuild-Attempted
✔ coneBuild-Attempted
✔ febootstrapBuild-Attempted
✔ ghemicalBuild-Attempted
✔ haskell-xml-html-qqBuild-Attempted
✔ jocamlBuild-Attempted
✔ leela-zeroBuild-Attempted
✔ mariadb-connector-odbcBuild-Attempted
✔ mrsBuild-Attempted
✔ odcBuild-Attempted
✔ openmmBuild-Attempted
✔ pinfishBuild-Attempted
✔ projectmBuild-Attempted
✔ r-cran-s2Build-Attempted
✔ rust-servo-freetype-sysBuild-Attempted
Package armhf
Buildd exposure stats
✔ tinyarrayBuild-Attempted
✔ rheolefBuild-Attempted
✔ sfcgalBuild-Attempted
✔ qtwebengine-opensource-srcMaybe-Failed
✔ openstructureBuild-Attempted

Tail of log for python-skbio on armhf:

FAILED skbio/stats/distance/tests/test_mantel.py::PairwiseMantelTests::test_many_filepaths_as_input
FAILED skbio/stats/distance/tests/test_mantel.py::PairwiseMantelTests::test_minimal_compatible_input
FAILED skbio/stats/distance/tests/test_mantel.py::PairwiseMantelTests::test_minimal_compatible_input_with_labels
FAILED skbio/stats/distance/tests/test_mantel.py::PairwiseMantelTests::test_na_p_value
FAILED skbio/stats/distance/tests/test_mantel.py::PairwiseMantelTests::test_reordered_distance_matrices
FAILED skbio/stats/distance/tests/test_mantel.py::PairwiseMantelTests::test_strict
FAILED skbio/stats/tests/test_subsample.py::SubsampleCountsTests::test_subsample_counts_nonrandom
FAILED skbio/stats/tests/test_subsample.py::SubsampleCountsTests::test_subsample_counts_without_replacement
FAILED skbio/stats/tests/test_subsample.py::ISubsampleTests::test_isubsample_simple
FAILED skbio/stats/tests/test_subsample.py::ISubsampleTests::test_per_sample_sequences_complex
FAILED skbio/stats/tests/test_subsample.py::ISubsampleTests::test_per_sample_sequences_min_seqs
=== 87 failed, 2235 passed, 30 skipped, 17090 warnings in 224.87s (0:03:44) ====
E: pybuild pybuild:353: test: plugin distutils failed with: exit code=1: cd /<<PKGBUILDDIR>>/.pybuild/cpython3_3.9_skbio/build; python3.9 -m pytest 
dh_auto_test: error: pybuild --test --test-pytest -i python{version} -p 3.9 returned exit code 13
make: *** [debian/rules:13: binary-arch] Error 25

Tail of log for spades on armhf:

-- Looking for stdint.h - found
-- Looking for stddef.h
-- Looking for stddef.h - found
-- Check size of void*
-- Check size of void* - done
CMake Error at /<<PKGBUILDDIR>>/assembler/ext/src/jemalloc/CMakeLists.txt:79 (message):
  Unsupported pointer size


-- Configuring incomplete, errors occurred!
See also "/<<PKGBUILDDIR>>/assembler/build_spades/CMakeFiles/CMakeOutput.log".
See also "/<<PKGBUILDDIR>>/assembler/build_spades/CMakeFiles/CMakeError.log".
make[1]: *** [debian/rules:42: override_dh_auto_build] Error 1
make[1]: Leaving directory '/<<PKGBUILDDIR>>'
make: *** [debian/rules:24: build-arch] Error 2

Tail of log for tensorpipe on armhf:

/usr/bin/ld: CMakeFiles/tensorpipe_test.dir/util/ringbuffer/ringbuffer_test.cc.o: in function `std::__atomic_base<unsigned long long>::fetch_add(unsigned long long, std::memory_order)':
/usr/include/c++/10/bits/atomic_base.h:548: undefined reference to `__atomic_fetch_add_8'
/usr/bin/ld: CMakeFiles/tensorpipe_test.dir/util/ringbuffer/ringbuffer_test.cc.o: in function `std::__atomic_base<unsigned long long>::load(std::memory_order) const':
/usr/include/c++/10/bits/atomic_base.h:426: undefined reference to `__atomic_load_8'
/usr/bin/ld: /usr/include/c++/10/bits/atomic_base.h:426: undefined reference to `__atomic_load_8'
/usr/bin/ld: ../libtensorpipe.so.0: undefined reference to `__atomic_fetch_sub_8'
collect2: error: ld returned 1 exit status
make[3]: *** [tensorpipe/test/CMakeFiles/tensorpipe_test.dir/build.make:488: tensorpipe/test/tensorpipe_test] Error 1
make[3]: Leaving directory '/<<PKGBUILDDIR>>/obj-arm-linux-gnueabihf'
make[2]: *** [CMakeFiles/Makefile2:227: tensorpipe/test/CMakeFiles/tensorpipe_test.dir/all] Error 2
make[2]: Leaving directory '/<<PKGBUILDDIR>>/obj-arm-linux-gnueabihf'
make[1]: *** [Makefile:152: all] Error 2
make[1]: Leaving directory '/<<PKGBUILDDIR>>/obj-arm-linux-gnueabihf'
dh_auto_build: error: cd obj-arm-linux-gnueabihf && make -j4 "INSTALL=install --strip-program=true" VERBOSE=1 returned exit code 2
make: *** [debian/rules:9: binary-arch] Error 25

Tail of log for apf on armhf:

checking for suffix of executables... 
checking for suffix of object files... o
checking whether we are using the GNU C compiler... yes
checking whether arm-linux-gnueabihf-gcc accepts -g... yes
checking for arm-linux-gnueabihf-gcc option to accept ISO C89... none needed
checking for style of include used by make... GNU
checking dependency style of arm-linux-gnueabihf-gcc... gcc3
checking how to run the C preprocessor... arm-linux-gnueabihf-gcc -E
checking for grep that handles long lines and -e... /bin/grep
checking for egrep... /bin/grep -E
checking whether arm-linux-gnueabihf-gcc needs -traditional... no
checking for openssl... no
checking for SSL_library_init in -lssl... no
configure: error: "lib ssl not found!"
make: *** [debian/rules:29: config.status] Error 1

Tail of log for bcachefs-tools on armhf:

                 from libbcachefs/bcachefs_ioctl.h:7,
                 from cmd_data.c:6:
include/linux/slab.h: In function 'kmalloc':
include/linux/kernel.h:78:17: warning: comparison of distinct pointer types lacks a cast
   78 |  (void) (&_min1 == &_min2);  \
      |                 ^~
include/linux/slab.h:24:22: note: in expansion of macro 'min'
   24 |   size_t alignment = min(rounddown_pow_of_two(size), (size_t)PAGE_SIZE);
      |                      ^~~
make[1]: *** [<builtin>: cmd_assemble.o] Error 1
make[1]: *** [<builtin>: cmd_data.o] Error 1
make[1]: *** [<builtin>: cmd_attr.o] Error 1
make[1]: Leaving directory '/<<BUILDDIR>>/bcachefs-tools-0.1+git20201025.742dbbdb'
dh_auto_build: error: make -j4 "INSTALL=install --strip-program=true" returned exit code 2
make: *** [debian/rules:7: binary-arch] Error 25

Tail of log for cone on armhf:

myserverremoteconfig.C: In member function ‘mail::account* myServer::remoteConfig::login2()’:
myserverremoteconfig.C:145:11: error: cannot convert ‘bool’ to ‘mail::account*’ in return
  145 |    return false;
      |           ^~~~~
make[5]: *** [Makefile:849: myserverremoteconfig.o] Error 1
make[5]: Leaving directory '/<<PKGBUILDDIR>>/cone'
make[4]: *** [Makefile:970: all-recursive] Error 1
make[4]: Leaving directory '/<<PKGBUILDDIR>>/cone'
make[3]: *** [Makefile:617: all] Error 2
make[3]: Leaving directory '/<<PKGBUILDDIR>>/cone'
make[2]: *** [Makefile:370: all-recursive] Error 1
make[2]: Leaving directory '/<<PKGBUILDDIR>>'
make[1]: *** [Makefile:275: all] Error 2
make[1]: Leaving directory '/<<PKGBUILDDIR>>'
make: *** [/usr/share/cdbs/1/class/makefile.mk:77: debian/stamp-makefile-build] Error 2

Tail of log for febootstrap on armhf:

File "febootstrap_utils.ml", line 85, characters 42-46:
85 |   really_input chan data 0 (String.length data);
                                               ^^^^
Error: This expression has type bytes but an expression was expected of type
         string
make[4]: *** [Makefile:1275: febootstrap_utils.cmx] Error 2
make[4]: Leaving directory '/<<PKGBUILDDIR>>/src'
make[3]: *** [Makefile:1058: all-recursive] Error 1
make[3]: Leaving directory '/<<PKGBUILDDIR>>'
make[2]: *** [Makefile:996: all] Error 2
make[2]: Leaving directory '/<<PKGBUILDDIR>>'
dh_auto_build: error: make -j1 returned exit code 2
make[1]: *** [debian/rules:8: override_dh_auto_build] Error 25
make[1]: Leaving directory '/<<PKGBUILDDIR>>'
make: *** [debian/rules:11: build-arch] Error 2

Tail of log for ghemical on armhf:

/usr/bin/ld: /usr/lib/gcc/arm-linux-gnueabihf/10/../../../arm-linux-gnueabihf/libghemical.so: undefined reference to `sc::KeyVal::exists(char const*)'
/usr/bin/ld: /usr/lib/gcc/arm-linux-gnueabihf/10/../../../arm-linux-gnueabihf/libghemical.so: undefined reference to `sc::Appearance::Appearance(sc::Ref<sc::KeyVal> const&)'
/usr/bin/ld: /usr/lib/gcc/arm-linux-gnueabihf/10/../../../arm-linux-gnueabihf/libghemical.so: undefined reference to `sc::PrefixKeyVal::PrefixKeyVal(sc::Ref<sc::KeyVal> const&, char const*)'
/usr/bin/ld: /usr/lib/gcc/arm-linux-gnueabihf/10/../../../arm-linux-gnueabihf/libghemical.so: undefined reference to `sc::RenderedBallMolecule::RenderedBallMolecule(sc::Ref<sc::KeyVal> const&)'
collect2: error: ld returned 1 exit status
make[4]: *** [Makefile:595: ghemical] Error 1
make[4]: Leaving directory '/<<PKGBUILDDIR>>/src'
make[3]: *** [Makefile:682: all-recursive] Error 1
make[3]: Leaving directory '/<<PKGBUILDDIR>>/src'
make[2]: *** [Makefile:495: all] Error 2
make[2]: Leaving directory '/<<PKGBUILDDIR>>/src'
make[1]: *** [Makefile:427: all-recursive] Error 1
make[1]: Leaving directory '/<<PKGBUILDDIR>>'
dh_auto_build: error: make -j4 returned exit code 2
make: *** [debian/rules:13: build-arch] Error 25

Tail of log for haskell-xml-html-qq on armhf:

xml-html-qq-test: 
xml-html-qq-test:   -Mgrace=<n>
xml-html-qq-test:             The amount of allocation after the program receives a
xml-html-qq-test:             HeapOverflow exception before the exception is thrown again, if
xml-html-qq-test:             the program is still exceeding the heap limit.
xml-html-qq-test: 
xml-html-qq-test: RTS options may also be specified using the GHCRTS environment variable.
xml-html-qq-test: 
xml-html-qq-test: Other RTS options may be available for programs compiled a different way.
xml-html-qq-test: The GHC User's Guide has full details.
xml-html-qq-test: 
Test suite xml-html-qq-test: FAIL
Test suite logged to: dist-ghc/test/xml-html-qq-0.1.0.1-xml-html-qq-test.log
0 of 2 test suites (0 of 2 test cases) passed.
make: *** [/usr/share/cdbs/1/class/hlibrary.mk:154: check-ghc-stamp] Error 1

Tail of log for jocaml on armhf:

|---
| tools/ocamlmklib.ml | 5 +++++
| 1 file changed, 5 insertions(+)
|
|diff --git a/tools/ocamlmklib.ml b/tools/ocamlmklib.ml
|index d5bb84c..ab3ca2b 100644
|--- a/tools/ocamlmklib.ml
|+++ b/tools/ocamlmklib.ml
--------------------------
No file to patch.  Skipping patch.
1 out of 1 hunk ignored
Patch debian/patches/0001-Don-t-use-rpath.patch does not apply (enforce with -f)
make[1]: *** [debian/rules:22: override_dh_auto_configure] Error 1
make[1]: Leaving directory '/<<PKGBUILDDIR>>'
make: *** [debian/rules:85: build-arch] Error 2

Tail of log for leela-zero on armhf:

/usr/include/c++/10/bits/atomic_base.h:426: undefined reference to `__atomic_load_8'
/usr/bin/ld: /usr/include/c++/10/bits/atomic_base.h:426: undefined reference to `__atomic_load_8'
/usr/bin/ld: /usr/include/c++/10/bits/atomic_base.h:426: undefined reference to `__atomic_load_8'
/usr/bin/ld: /usr/include/c++/10/bits/atomic_base.h:426: undefined reference to `__atomic_load_8'
/usr/bin/ld: /usr/include/c++/10/bits/atomic_base.h:426: undefined reference to `__atomic_load_8'
/usr/bin/ld: CMakeFiles/objs.dir/src/UCTNodePointer.cpp.o:/usr/include/c++/10/bits/atomic_base.h:426: more undefined references to `__atomic_load_8' follow
collect2: error: ld returned 1 exit status
make[3]: *** [CMakeFiles/tests.dir/build.make:177: tests] Error 1
make[3]: Leaving directory '/<<PKGBUILDDIR>>/obj-arm-linux-gnueabihf'
make[2]: *** [CMakeFiles/Makefile2:208: CMakeFiles/tests.dir/all] Error 2
make[2]: Leaving directory '/<<PKGBUILDDIR>>/obj-arm-linux-gnueabihf'
make[1]: *** [Makefile:174: all] Error 2
make[1]: Leaving directory '/<<PKGBUILDDIR>>/obj-arm-linux-gnueabihf'
dh_auto_build: error: cd obj-arm-linux-gnueabihf && make -j4 "INSTALL=install --strip-program=true" VERBOSE=1 returned exit code 2
make: *** [debian/rules:15: build-arch] Error 25

Tail of log for mariadb-connector-odbc on armhf:

/usr/bin/cc -g -O2 -ffile-prefix-map=/<<PKGBUILDDIR>>=. -fstack-protector-strong -Wformat -Werror=format-security -I/usr/include/mariadb -Wdate-time -D_FORTIFY_SOURCE=2 -DCHECK_FUNCTION_EXISTS=floor -Wl,-z,relro  -rdynamic CMakeFiles/cmTC_6c438.dir/CheckFunctionExists.c.o -o cmTC_6c438 
/usr/bin/ld: CMakeFiles/cmTC_6c438.dir/CheckFunctionExists.c.o: in function `main':
/usr/share/cmake-3.18/Modules/CheckFunctionExists.c:17: undefined reference to `floor'
collect2: error: ld returned 1 exit status
gmake[3]: *** [CMakeFiles/cmTC_6c438.dir/build.make:106: cmTC_6c438] Error 1
gmake[3]: Leaving directory '/<<PKGBUILDDIR>>/obj-arm-linux-gnueabihf/CMakeFiles/CMakeTmp'
gmake[2]: *** [Makefile:140: cmTC_6c438/fast] Error 2
gmake[2]: Leaving directory '/<<PKGBUILDDIR>>/obj-arm-linux-gnueabihf/CMakeFiles/CMakeTmp'



dh_auto_configure: error: cd obj-arm-linux-gnueabihf && cmake -DCMAKE_INSTALL_PREFIX=/usr -DCMAKE_BUILD_TYPE=None -DCMAKE_INSTALL_SYSCONFDIR=/etc -DCMAKE_INSTALL_LOCALSTATEDIR=/var -DCMAKE_EXPORT_NO_PACKAGE_REGISTRY=ON -DCMAKE_FIND_PACKAGE_NO_PACKAGE_REGISTRY=ON -DCMAKE_INSTALL_RUNSTATEDIR=/run "-GUnix Makefiles" -DCMAKE_VERBOSE_MAKEFILE=ON -DCMAKE_INSTALL_LIBDIR=lib/arm-linux-gnueabihf -DMARIADB_LINK_DYNAMIC=yes -DINSTALL_LIBDIR=lib/arm-linux-gnueabihf/odbc .. returned exit code 1
make[1]: *** [debian/rules:11: override_dh_auto_configure] Error 25
make[1]: Leaving directory '/<<PKGBUILDDIR>>'
make: *** [debian/rules:8: build-arch] Error 2

Tail of log for mrs on armhf:

   debian/rules override_dh_auto_configure
make[1]: Entering directory '/<<BUILDDIR>>/mrs-6.0.5+dfsg'
./configure --prefix=/usr --config-dir=/etc/mrs/ \
	--man-dir=/usr/share/man --mrs-user=mrs-dba \
	--data-dir=/var/lib/mrs --log-dir=/var/log/mrs
length() used on @boost_version (did you mean "scalar(@boost_version)"?) at ./configure line 289.
Using perl /usr/bin/perl
Checking for a compiler... OK
Checking for libboost... OK
Checking for libzeep...libzeep is not installed, either install the package libzeep-dev
or download libzeep from ftp://ftp.cmbi.ru.nl/pub/software/libzeep
and run configure again.
make[1]: *** [debian/rules:15: override_dh_auto_configure] Error 2
make[1]: Leaving directory '/<<BUILDDIR>>/mrs-6.0.5+dfsg'
make: *** [debian/rules:12: binary-arch] Error 2

Tail of log for odc on armhf:

/<<PKGBUILDDIR>>/src/odc/codec/Integer.h:84:41: error: static assertion failed: unsafe casting check
/<<PKGBUILDDIR>>/src/odc/codec/Integer.h: In instantiation of 'void odc::codec::CodecIntegerOffset<ByteOrder, ValueType, InternalValueType, DerivedCodec>::decode(double*) [with ByteOrder = odc::core::OtherByteOrder; ValueType = long long int; InternalValueType = short unsigned int; DerivedCodec = odc::codec::CodecInt16<odc::core::OtherByteOrder, long long int>]':
/<<PKGBUILDDIR>>/src/odc/codec/Integer.h:83:10:   required from here
/<<PKGBUILDDIR>>/src/odc/codec/Integer.h:84:41: error: static assertion failed: unsafe casting check
/<<PKGBUILDDIR>>/src/odc/codec/Integer.h: In instantiation of 'void odc::codec::CodecIntegerOffset<ByteOrder, ValueType, InternalValueType, DerivedCodec>::decode(double*) [with ByteOrder = odc::core::SameByteOrder; ValueType = long long int; InternalValueType = short unsigned int; DerivedCodec = odc::codec::CodecInt16<odc::core::SameByteOrder, long long int>]':
/<<PKGBUILDDIR>>/src/odc/codec/Integer.h:83:10:   required from here
/<<PKGBUILDDIR>>/src/odc/codec/Integer.h:84:41: error: static assertion failed: unsafe casting check
make[3]: *** [src/odc/CMakeFiles/odccore.dir/build.make:631: src/odc/CMakeFiles/odccore.dir/codec/String.cc.o] Error 1
make[3]: Leaving directory '/<<PKGBUILDDIR>>/obj-arm-linux-gnueabihf'
make[2]: *** [CMakeFiles/Makefile2:1319: src/odc/CMakeFiles/odccore.dir/all] Error 2
make[2]: Leaving directory '/<<PKGBUILDDIR>>/obj-arm-linux-gnueabihf'
make[1]: *** [Makefile:185: all] Error 2
make[1]: Leaving directory '/<<PKGBUILDDIR>>/obj-arm-linux-gnueabihf'
dh_auto_build: error: cd obj-arm-linux-gnueabihf && make -j4 "INSTALL=install --strip-program=true" returned exit code 2
make: *** [debian/rules:19: build-arch] Error 25

Tail of log for openmm on armhf:

In file included from /<<BUILDDIR>>/openmm-7.5.0+dfsg/libraries/vecmath/src/vecmath.cpp:2:
/<<BUILDDIR>>/openmm-7.5.0+dfsg/libraries/vecmath/include/neon_mathfun.h:53:25: note: called from here
   53 |   v4sf one = vdupq_n_f32(1);
      |              ~~~~~~~~~~~^~~
make[4]: *** [CMakeFiles/OpenMM.dir/build.make:2542: CMakeFiles/OpenMM.dir/libraries/vecmath/src/vecmath.cpp.o] Error 1
make[4]: *** Waiting for unfinished jobs....
make[4]: Leaving directory '/<<BUILDDIR>>/openmm-7.5.0+dfsg/obj-arm-linux-gnueabihf'
make[3]: *** [CMakeFiles/Makefile2:1412: CMakeFiles/OpenMM.dir/all] Error 2
make[3]: Leaving directory '/<<BUILDDIR>>/openmm-7.5.0+dfsg/obj-arm-linux-gnueabihf'
make[2]: *** [Makefile:163: all] Error 2
make[2]: Leaving directory '/<<BUILDDIR>>/openmm-7.5.0+dfsg/obj-arm-linux-gnueabihf'
dh_auto_build: error: cd obj-arm-linux-gnueabihf && make -j4 "INSTALL=install --strip-program=true" VERBOSE=1 returned exit code 2
make[1]: *** [debian/rules:31: override_dh_auto_build] Error 25
make[1]: Leaving directory '/<<BUILDDIR>>/openmm-7.5.0+dfsg'
make: *** [debian/rules:25: binary-arch] Error 2

Tail of log for pinfish on armhf:

github.com/biogo/hts/bgzf
runtime/pprof
github.com/biogo/hts/bgzf/index
github.com/biogo/hts/internal
github.com/biogo/hts/sam
github.com/biogo/hts/bam
github.com/nanoporetech/pinfish/polish_clusters
github.com/nanoporetech/pinfish/spliced_bam2gff
# github.com/nanoporetech/pinfish/polish_clusters
src/github.com/nanoporetech/pinfish/polish_clusters/polish.go:161:6: constant 9223372036854775807 overflows int
github.com/google/uuid
github.com/nanoporetech/pinfish/cluster_gff
github.com/nanoporetech/pinfish/collapse_partials
dh_auto_build: error: cd _build && go install -trimpath -v -p 4 github.com/nanoporetech/pinfish/cluster_gff github.com/nanoporetech/pinfish/collapse_partials github.com/nanoporetech/pinfish/polish_clusters github.com/nanoporetech/pinfish/spliced_bam2gff returned exit code 2
make: *** [debian/rules:4: binary-arch] Error 25

Tail of log for projectm on armhf:

qprojectm_mainwindow.cpp:551:3: note: here
  551 |   case Qt::Key_L:
      |   ^~~~
make[5]: *** [Makefile:533: qprojectm_mainwindow.o] Error 1
make[5]: Leaving directory '/<<PKGBUILDDIR>>/src/projectM-qt'
make[4]: *** [Makefile:454: all] Error 2
make[4]: Leaving directory '/<<PKGBUILDDIR>>/src/projectM-qt'
make[3]: *** [Makefile:458: all-recursive] Error 1
make[3]: Leaving directory '/<<PKGBUILDDIR>>/src'
make[2]: *** [Makefile:528: all-recursive] Error 1
make[2]: Leaving directory '/<<PKGBUILDDIR>>'
make[1]: *** [Makefile:418: all] Error 2
make[1]: Leaving directory '/<<PKGBUILDDIR>>'
dh_auto_build: error: make -j4 returned exit code 2
make: *** [debian/rules:9: binary-arch] Error 25

Tail of log for r-cran-s2 on armhf:

      |                                                    ^~
In file included from /usr/include/openssl/bn.h:19,
                 from ../inst/include/s2/util/math/exactfloat/exactfloat.h:119,
                 from s2/util/math/exactfloat/exactfloat.cc:18:
/usr/include/openssl/ossl_typ.h:80:16: note: forward declaration of 'BIGNUM' {aka 'struct bignum_st'}
   80 | typedef struct bignum_st BIGNUM;
      |                ^~~~~~~~~
make[1]: *** [/usr/lib/R/etc/Makeconf:179: s2/util/math/exactfloat/exactfloat.o] Error 1
make[1]: Leaving directory '/<<PKGBUILDDIR>>/src'
make[1]: Entering directory '/<<PKGBUILDDIR>>/src'
make[1]: Leaving directory '/<<PKGBUILDDIR>>/src'
ERROR: compilation failed for package 's2'
* removing '/<<PKGBUILDDIR>>/debian/r-cran-s2/usr/lib/R/site-library/s2'
dh_auto_install: error: R CMD INSTALL -l /<<PKGBUILDDIR>>/debian/r-cran-s2/usr/lib/R/site-library --clean . "--built-timestamp='Sat, 16 Jan 2021 17:30:37 +0100'" returned exit code 1
make: *** [debian/rules:4: binary-arch] Error 25

Tail of log for rust-servo-freetype-sys on armhf:

     2: cmake::fail
               at ./debian/cargo_registry/cmake-0.1.44/src/lib.rs:885
     3: cmake::run
               at ./debian/cargo_registry/cmake-0.1.44/src/lib.rs:863
     4: cmake::Config::build
               at ./debian/cargo_registry/cmake-0.1.44/src/lib.rs:698
     5: build_script_build::main
               at ./build.rs:23
     6: core::ops::function::FnOnce::call_once
               at /usr/src/rustc-1.48.0/library/core/src/ops/function.rs:227
  note: Some details are omitted, run with `RUST_BACKTRACE=full` for a verbose backtrace.
dh_auto_test: error: /usr/share/cargo/bin/cargo test --all returned exit code 101
make[1]: *** [debian/rules:6: override_dh_auto_test] Error 25
make[1]: Leaving directory '/<<PKGBUILDDIR>>'
make: *** [debian/rules:3: build-arch] Error 2

Tail of log for tinyarray on armhf:

  File "/usr/lib/python3/dist-packages/pluggy/callers.py", line 187 in _multicall
  File "/usr/lib/python3/dist-packages/pluggy/manager.py", line 83 in <lambda>
  File "/usr/lib/python3/dist-packages/pluggy/manager.py", line 92 in _hookexec
  File "/usr/lib/python3/dist-packages/pluggy/hooks.py", line 286 in __call__
  File "/usr/lib/python3/dist-packages/_pytest/config/__init__.py", line 157 in main
  File "/usr/lib/python3/dist-packages/_pytest/config/__init__.py", line 180 in console_main
  File "/usr/lib/python3/dist-packages/pytest/__main__.py", line 7 in <module>
  File "/usr/lib/python3.9/runpy.py", line 87 in _run_code
  File "/usr/lib/python3.9/runpy.py", line 197 in _run_module_as_main
Aborted
E: pybuild pybuild:353: test: plugin distutils failed with: exit code=134: cd /<<PKGBUILDDIR>>/.pybuild/cpython3_3.9_tinyarray/build; python3.9 -m pytest ../../../test_tinyarray.py
dh_auto_test: error: pybuild --test --test-pytest -i python{version} -p 3.9 --test-pytest --test-args=../../../test_tinyarray.py returned exit code 13
make[1]: *** [debian/rules:11: override_dh_auto_test] Error 25
make[1]: Leaving directory '/<<PKGBUILDDIR>>'
make: *** [debian/rules:7: binary-arch] Error 2

Tail of log for rheolef on armhf:

/usr/bin/ld: ./.libs/libfem.a(geo_domain_indirect_seq.o):(.data.rel.ro+0x18): multiple definition of `typeinfo for rheolef::geo_domain_indirect_rep<double, rheolef::sequential>'; ./.libs/libfem.a(geo_domain_indirect.o):(.data.rel.ro+0x0): first defined here
/usr/bin/ld: ./.libs/libfem.a(geo_domain_indirect_mpi.o):(.rodata+0x0): multiple definition of `typeinfo name for rheolef::geo_domain_indirect_rep<double, rheolef::distributed>'; ./.libs/libfem.a(geo_domain_indirect.o):(.rodata+0x38): first defined here
/usr/bin/ld: ./.libs/libfem.a(geo_domain_indirect_mpi.o):(.data.rel.ro+0x0): multiple definition of `typeinfo for rheolef::geo_domain_indirect_rep<double, rheolef::distributed>'; ./.libs/libfem.a(geo_domain_indirect.o):(.data.rel.ro+0xc): first defined here
/usr/bin/ld: ./.libs/libfem.a(geo_domain_seq.o):(.rodata+0x0): multiple definition of `typeinfo name for rheolef::geo_rep<double, rheolef::sequential>'; ./.libs/libfem.a(geo.o):(.rodata+0x2c): first defined here
/usr/bin/ld: ./.libs/libfem.a(geo_domain_seq.o):(.data.rel.ro+0x0): multiple definition of `typeinfo for rheolef::geo_rep<double, rheolef::sequential>'; ./.libs/libfem.a(geo.o):(.data.rel.ro+0xc): first defined here
/usr/bin/ld: ./.libs/libfem.a(geo_domain_mpi.o):(.rodata+0x0): multiple definition of `typeinfo name for rheolef::geo_rep<double, rheolef::distributed>'; ./.libs/libfem.a(geo.o):(.rodata+0x84): first defined here
/usr/bin/ld: ./.libs/libfem.a(geo_domain_mpi.o):(.data.rel.ro+0x0): multiple definition of `typeinfo for rheolef::geo_rep<double, rheolef::distributed>'; ./.libs/libfem.a(geo.o):(.data.rel.ro+0x24): first defined here
collect2: error: ld returned 1 exit status
make[4]: *** [Makefile:947: librheolef.la] Error 1
make[3]: *** [Makefile:863: all] Error 2
make[2]: *** [Makefile:445: all-recursive] Error 1
make[1]: *** [Makefile:514: all-recursive] Error 1
make[1]: Leaving directory '/<<PKGBUILDDIR>>'
dh_auto_build: error: make -j4 returned exit code 2
make: *** [debian/rules:30: build-arch] Error 25

Tail of log for sfcgal on armhf:

/usr/bin/ld: CMakeFiles/SFCGAL.dir/detail/generator/building.cpp.o:(.data.rel.ro+0x3c): multiple definition of `typeinfo for CORE::AddSubRep<CORE::Add>'; CMakeFiles/SFCGAL.dir/algorithm/straightSkeleton.cpp.o:(.data.rel.ro+0x3c): first defined here
/usr/bin/ld: CMakeFiles/SFCGAL.dir/detail/generator/building.cpp.o:(.data.rel.ro+0x48): multiple definition of `typeinfo for CORE::AddSubRep<CORE::Sub>'; CMakeFiles/SFCGAL.dir/algorithm/straightSkeleton.cpp.o:(.data.rel.ro+0x48): first defined here
/usr/bin/ld: CMakeFiles/SFCGAL.dir/detail/generator/building.cpp.o:(.data.rel.ro+0x54): multiple definition of `typeinfo for CORE::ConstPolyRep<CORE::Expr>'; CMakeFiles/SFCGAL.dir/algorithm/straightSkeleton.cpp.o:(.data.rel.ro+0x54): first defined here
/usr/bin/ld: CMakeFiles/SFCGAL.dir/detail/generator/building.cpp.o:(.data.rel.ro+0x60): multiple definition of `typeinfo for CORE::ConstPolyRep<CORE::BigFloat>'; CMakeFiles/SFCGAL.dir/algorithm/straightSkeleton.cpp.o:(.data.rel.ro+0x60): first defined here
/usr/bin/ld: CMakeFiles/SFCGAL.dir/detail/generator/building.cpp.o:(.data.rel.ro+0x6c): multiple definition of `typeinfo for CORE::ConstPolyRep<CORE::BigInt>'; CMakeFiles/SFCGAL.dir/algorithm/straightSkeleton.cpp.o:(.data.rel.ro+0x6c): first defined here
/usr/bin/ld: CMakeFiles/SFCGAL.dir/detail/generator/building.cpp.o:(.data.rel.ro+0x78): multiple definition of `typeinfo for CORE::ConstPolyRep<CORE::BigRat>'; CMakeFiles/SFCGAL.dir/algorithm/straightSkeleton.cpp.o:(.data.rel.ro+0x78): first defined here
collect2: error: ld returned 1 exit status
make[3]: *** [src/CMakeFiles/SFCGAL.dir/build.make:1423: src/libSFCGAL.so.1.3.8] Error 1
make[3]: Leaving directory '/<<PKGBUILDDIR>>/obj-arm-linux-gnueabihf'
make[2]: *** [CMakeFiles/Makefile2:280: src/CMakeFiles/SFCGAL.dir/all] Error 2
make[2]: Leaving directory '/<<PKGBUILDDIR>>/obj-arm-linux-gnueabihf'
make[1]: *** [Makefile:163: all] Error 2
make[1]: Leaving directory '/<<PKGBUILDDIR>>/obj-arm-linux-gnueabihf'
dh_auto_build: error: cd obj-arm-linux-gnueabihf && make -j4 VERBOSE=1 returned exit code 2
make: *** [debian/rules:22: build-arch] Error 25

Tail of log for qtwebengine-opensource-src on armhf:

[17164/20506] /usr/bin/g++ -MMD -MF obj/third_party/blink/renderer/core/exported/exported/exported_jumbo_8.o.d -DBLINK_IMPLEMENTATION=1 -DUSE_UDEV -DUSE_AURA=1 -DUSE_NSS_CERTS=1 -DUSE_OZONE=1 -DOFFICIAL_BUILD -DTOOLKIT_QT -D_FILE_OFFSET_BITS=64 -D_LARGEFILE_SOURCE -D_LARGEFILE64_SOURCE -DNO_UNWIND_TABLES -D__STDC_CONSTANT_MACROS -D__STDC_FORMAT_MACROS -DNDEBUG -DNVALGRIND -DDYNAMIC_ANNOTATIONS_ENABLED=0 -DBLINK_CORE_IMPLEMENTATION=1 -DVK_NO_PROTOTYPES -DGL_GLEXT_PROTOTYPES -DUSE_GLX -DUSE_EGL -DBLINK_IMPLEMENTATION=1 -DINSIDE_BLINK -DUSING_SYSTEM_ICU=1 -DICU_UTIL_DATA_IMPL=ICU_UTIL_DATA_STATIC -DUCHAR_TYPE=uint16_t -DGOOGLE_PROTOBUF_NO_RTTI -DGOOGLE_PROTOBUF_NO_STATIC_INITIALIZER -DHAVE_PTHREAD -DWEBRTC_NON_STATIC_TRACE_EVENT_HANDLERS=0 -DWEBRTC_CHROMIUM_BUILD -DWEBRTC_POSIX -DWEBRTC_LINUX -DABSL_ALLOCATOR_NOTHROW=1 -DWEBRTC_USE_BUILTIN_ISAC_FIX=1 -DWEBRTC_USE_BUILTIN_ISAC_FLOAT=0 -DWEBRTC_USE_X11 -DWEBRTC_USE_X11 -DHAVE_SCTP -DNO_MAIN_THREAD_WRAPPING -DSK_CODEC_DECODES_PNG -DSK_CODEC_DECODES_WEBP -DSK_ENCODE_PNG -DSK_ENCODE_WEBP -DSK_USER_CONFIG_HEADER=\"../../skia/config/SkUserConfig.h\" -DSK_GL -DSK_CODEC_DECODES_JPEG -DSK_ENCODE_JPEG -DSK_USE_LIBGIFCODEC -DSK_VULKAN_HEADER=\"../../skia/config/SkVulkanConfig.h\" -DSK_VULKAN=1 -DSK_SUPPORT_GPU=1 -DSK_GPU_WORKAROUNDS_HEADER=\"gpu/config/gpu_driver_bug_workaround_autogen.h\" -DVK_NO_PROTOTYPES -DV8_DEPRECATION_WARNINGS -DUSING_SYSTEM_ICU=1 -DICU_UTIL_DATA_IMPL=ICU_UTIL_DATA_STATIC -DUCHAR_TYPE=uint16_t -DCRASHPAD_ZLIB_SOURCE_EXTERNAL -DUSE_SYSTEM_ZLIB=1 -DLEVELDB_PLATFORM_CHROMIUM=1 -DLEVELDB_PLATFORM_CHROMIUM=1 -DSUPPORT_WEBGL2_COMPUTE_CONTEXT=1 -DWTF_USE_WEBAUDIO_PFFFT=1 -DUSE_SYSTEM_LIBJPEG -DV8_DEPRECATION_WARNINGS -I. -Igen -I../../3rdparty/chromium -Igen -Igen -Igen -Igen -I../../3rdparty/chromium/third_party/perfetto/include -Igen/third_party/perfetto/build_config -Igen/third_party/perfetto -I../../3rdparty/chromium/third_party/libyuv/include -Igen -I../../3rdparty/chromium/third_party/jsoncpp/source/include -I../../3rdparty/chromium/third_party/jsoncpp/generated -Igen -Igen -Igen -Igen -Igen -Igen -Igen -I../../3rdparty/chromium/third_party/vulkan/include -Igen -Igen -Igen -I../../3rdparty/chromium/third_party/khronos -I../../3rdparty/chromium/gpu -Igen/third_party/dawn/src/include -I../../3rdparty/chromium/third_party/dawn/src/include -I../../3rdparty/chromium/third_party/boringssl/src/include -I../../3rdparty/chromium/third_party/ced/src -I../../3rdparty/chromium/third_party/protobuf/src -I../../3rdparty/chromium/third_party/protobuf/src -Igen/protoc_out -I../../3rdparty/chromium/third_party/webrtc_overrides -I../../3rdparty/chromium/third_party/webrtc -Igen/third_party/webrtc -I../../3rdparty/chromium/third_party/abseil-cpp -I../../3rdparty/chromium/third_party/skia -I../../3rdparty/chromium/third_party/libgifcodec -I../../3rdparty/chromium/third_party/vulkan/include -I../../3rdparty/chromium/third_party/skia/third_party/vulkanmemoryallocator -I../../3rdparty/chromium/third_party/vulkan/include -I../../3rdparty/chromium/third_party/angle/include -I../../3rdparty/chromium/third_party/angle/src/common/third_party/base -Igen/angle -I../../3rdparty/chromium/third_party/angle/include -I../../3rdparty/chromium/v8/include -Igen/v8/include -I../../3rdparty/chromium/third_party/crashpad/crashpad -I../../3rdparty/chromium/third_party/crashpad/crashpad/compat/non_mac -I../../3rdparty/chromium/third_party/crashpad/crashpad/compat/linux -I../../3rdparty/chromium/third_party/crashpad/crashpad/compat/non_win -I../../3rdparty/chromium/third_party/libwebm/source -I../../3rdparty/chromium/third_party/leveldatabase -I../../3rdparty/chromium/third_party/leveldatabase/src -I../../3rdparty/chromium/third_party/leveldatabase/src/include -I../../3rdparty/chromium/third_party/iccjpeg -I../../3rdparty/chromium/third_party/ots/include -I../../3rdparty/chromium/v8/include -Igen/v8/include -fno-strict-aliasing --param=ssp-buffer-size=4 -fstack-protector -fno-unwind-tables -fno-asynchronous-unwind-tables -fPIC -pipe -pthread -march=armv7-a -mfloat-abi=hard -mtune=generic-armv7-a -mfpu=vfpv3-d16 -marm -Wall -U_FORTIFY_SOURCE -D_FORTIFY_SOURCE=2 -Wno-psabi -Wno-unused-local-typedefs -Wno-maybe-uninitialized -Wno-deprecated-declarations -fno-delete-null-pointer-checks -Wno-comments -Wno-packed-not-aligned -Wno-dangling-else -Wno-missing-field-initializers -Wno-unused-parameter -fno-omit-frame-pointer -fvisibility=hidden -O2 -fno-ident -fdata-sections -ffunction-sections -g0 -Wno-unused-variable -I/usr/include/nss -I/usr/include/nspr -I/usr/include/libpng16 -I/usr/include/libxml2 -I/usr/include/libxml2 -std=gnu++14 -Wno-narrowing -Wno-class-memaccess -Wno-attributes -Wno-class-memaccess -Wno-subobject-linkage -Wno-invalid-offsetof -Wno-return-type -Wno-deprecated-copy -fno-exceptions -fno-rtti -fvisibility-inlines-hidden -Wno-deprecated-declarations -c gen/third_party/blink/renderer/core/exported/exported_jumbo_8.cc -o obj/third_party/blink/renderer/core/exported/exported/exported_jumbo_8.o
[17165/20506] /usr/bin/g++ -MMD -MF obj/third_party/blink/renderer/core/inspector/inspector/inspector_jumbo_4.o.d -DUSE_UDEV -DUSE_AURA=1 -DUSE_NSS_CERTS=1 -DUSE_OZONE=1 -DOFFICIAL_BUILD -DTOOLKIT_QT -D_FILE_OFFSET_BITS=64 -D_LARGEFILE_SOURCE -D_LARGEFILE64_SOURCE -DNO_UNWIND_TABLES -D__STDC_CONSTANT_MACROS -D__STDC_FORMAT_MACROS -DNDEBUG -DNVALGRIND -DDYNAMIC_ANNOTATIONS_ENABLED=0 -DBLINK_CORE_IMPLEMENTATION=1 -DVK_NO_PROTOTYPES -DGL_GLEXT_PROTOTYPES -DUSE_GLX -DUSE_EGL -DBLINK_IMPLEMENTATION=1 -DINSIDE_BLINK -DUSING_SYSTEM_ICU=1 -DICU_UTIL_DATA_IMPL=ICU_UTIL_DATA_STATIC -DUCHAR_TYPE=uint16_t -DGOOGLE_PROTOBUF_NO_RTTI -DGOOGLE_PROTOBUF_NO_STATIC_INITIALIZER -DHAVE_PTHREAD -DWEBRTC_NON_STATIC_TRACE_EVENT_HANDLERS=0 -DWEBRTC_CHROMIUM_BUILD -DWEBRTC_POSIX -DWEBRTC_LINUX -DABSL_ALLOCATOR_NOTHROW=1 -DWEBRTC_USE_BUILTIN_ISAC_FIX=1 -DWEBRTC_USE_BUILTIN_ISAC_FLOAT=0 -DWEBRTC_USE_X11 -DWEBRTC_USE_X11 -DHAVE_SCTP -DNO_MAIN_THREAD_WRAPPING -DSK_CODEC_DECODES_PNG -DSK_CODEC_DECODES_WEBP -DSK_ENCODE_PNG -DSK_ENCODE_WEBP -DSK_USER_CONFIG_HEADER=\"../../skia/config/SkUserConfig.h\" -DSK_GL -DSK_CODEC_DECODES_JPEG -DSK_ENCODE_JPEG -DSK_USE_LIBGIFCODEC -DSK_VULKAN_HEADER=\"../../skia/config/SkVulkanConfig.h\" -DSK_VULKAN=1 -DSK_SUPPORT_GPU=1 -DSK_GPU_WORKAROUNDS_HEADER=\"gpu/config/gpu_driver_bug_workaround_autogen.h\" -DVK_NO_PROTOTYPES -DV8_DEPRECATION_WARNINGS -DUSING_SYSTEM_ICU=1 -DICU_UTIL_DATA_IMPL=ICU_UTIL_DATA_STATIC -DUCHAR_TYPE=uint16_t -DCRASHPAD_ZLIB_SOURCE_EXTERNAL -DUSE_SYSTEM_ZLIB=1 -DLEVELDB_PLATFORM_CHROMIUM=1 -DLEVELDB_PLATFORM_CHROMIUM=1 -DSUPPORT_WEBGL2_COMPUTE_CONTEXT=1 -DWTF_USE_WEBAUDIO_PFFFT=1 -DUSE_SYSTEM_LIBJPEG -DV8_DEPRECATION_WARNINGS -I. -Igen -I../../3rdparty/chromium -Igen -Igen -Igen -Igen -I../../3rdparty/chromium/third_party/perfetto/include -Igen/third_party/perfetto/build_config -Igen/third_party/perfetto -I../../3rdparty/chromium/third_party/libyuv/include -Igen -I../../3rdparty/chromium/third_party/jsoncpp/source/include -I../../3rdparty/chromium/third_party/jsoncpp/generated -Igen -Igen -Igen -Igen -Igen -Igen -Igen -I../../3rdparty/chromium/third_party/vulkan/include -Igen -Igen -Igen -I../../3rdparty/chromium/third_party/khronos -I../../3rdparty/chromium/gpu -Igen/third_party/dawn/src/include -I../../3rdparty/chromium/third_party/dawn/src/include -I../../3rdparty/chromium/third_party/boringssl/src/include -I../../3rdparty/chromium/third_party/ced/src -I../../3rdparty/chromium/third_party/protobuf/src -I../../3rdparty/chromium/third_party/protobuf/src -Igen/protoc_out -I../../3rdparty/chromium/third_party/webrtc_overrides -I../../3rdparty/chromium/third_party/webrtc -Igen/third_party/webrtc -I../../3rdparty/chromium/third_party/abseil-cpp -I../../3rdparty/chromium/third_party/skia -I../../3rdparty/chromium/third_party/libgifcodec -I../../3rdparty/chromium/third_party/vulkan/include -I../../3rdparty/chromium/third_party/skia/third_party/vulkanmemoryallocator -I../../3rdparty/chromium/third_party/vulkan/include -I../../3rdparty/chromium/third_party/angle/include -I../../3rdparty/chromium/third_party/angle/src/common/third_party/base -Igen/angle -I../../3rdparty/chromium/third_party/angle/include -I../../3rdparty/chromium/v8/include -Igen/v8/include -I../../3rdparty/chromium/third_party/crashpad/crashpad -I../../3rdparty/chromium/third_party/crashpad/crashpad/compat/non_mac -I../../3rdparty/chromium/third_party/crashpad/crashpad/compat/linux -I../../3rdparty/chromium/third_party/crashpad/crashpad/compat/non_win -I../../3rdparty/chromium/third_party/libwebm/source -I../../3rdparty/chromium/third_party/leveldatabase -I../../3rdparty/chromium/third_party/leveldatabase/src -I../../3rdparty/chromium/third_party/leveldatabase/src/include -I../../3rdparty/chromium/third_party/iccjpeg -I../../3rdparty/chromium/third_party/ots/include -I../../3rdparty/chromium/v8/include -Igen/v8/include -fno-strict-aliasing --param=ssp-buffer-size=4 -fstack-protector -fno-unwind-tables -fno-asynchronous-unwind-tables -fPIC -pipe -pthread -march=armv7-a -mfloat-abi=hard -mtune=generic-armv7-a -mfpu=vfpv3-d16 -marm -Wall -U_FORTIFY_SOURCE -D_FORTIFY_SOURCE=2 -Wno-psabi -Wno-unused-local-typedefs -Wno-maybe-uninitialized -Wno-deprecated-declarations -fno-delete-null-pointer-checks -Wno-comments -Wno-packed-not-aligned -Wno-dangling-else -Wno-missing-field-initializers -Wno-unused-parameter -fno-omit-frame-pointer -fvisibility=hidden -O2 -fno-ident -fdata-sections -ffunction-sections -g0 -Wno-unused-variable -I/usr/include/nss -I/usr/include/nspr -I/usr/include/libpng16 -I/usr/include/libxml2 -I/usr/include/libxml2 -std=gnu++14 -Wno-narrowing -Wno-class-memaccess -Wno-attributes -Wno-class-memaccess -Wno-subobject-linkage -Wno-invalid-offsetof -Wno-return-type -Wno-deprecated-copy -fno-exceptions -fno-rtti -fvisibility-inlines-hidden -Wno-deprecated-declarations -c gen/third_party/blink/renderer/core/inspector/inspector_jumbo_4.cc -o obj/third_party/blink/renderer/core/inspector/inspector/inspector_jumbo_4.o
ninja: build stopped: subcommand failed.
make[5]: *** [Makefile.gn_run:360: run_ninja] Error 1
make[5]: Leaving directory '/<<BUILDDIR>>/qtwebengine-opensource-src-5.15.2+dfsg/src/core'
make[4]: *** [Makefile:82: sub-gn_run-pro-make_first] Error 2
make[4]: Leaving directory '/<<BUILDDIR>>/qtwebengine-opensource-src-5.15.2+dfsg/src/core'
make[3]: *** [Makefile:80: sub-core-make_first] Error 2
make[3]: Leaving directory '/<<BUILDDIR>>/qtwebengine-opensource-src-5.15.2+dfsg/src'
make[2]: *** [Makefile:49: sub-src-make_first] Error 2
make[2]: Leaving directory '/<<BUILDDIR>>/qtwebengine-opensource-src-5.15.2+dfsg'
dh_auto_build: error: make -j4 -Onone returned exit code 2
make[1]: *** [debian/rules:152: override_dh_auto_build-arch] Error 25
make[1]: Leaving directory '/<<BUILDDIR>>/qtwebengine-opensource-src-5.15.2+dfsg'
make: *** [debian/rules:56: build-arch] Error 2

Tail of log for openstructure on armhf:

unable to open database file
WARNING: skipping mmcif_entity_poly_tests unit test. Compound library is required
unable to open database file

*** No errors detected
make[4]: Leaving directory '/<<PKGBUILDDIR>>/obj-arm-linux-gnueabihf'
[100%] Built target ost_io_tests_run
.
----------------------------------------------------------------------
Ran 2 tests in 66.747s

OK
Could not find CAD score classic executables: ignoring unit tests
make[4]: Leaving directory '/<<PKGBUILDDIR>>/obj-arm-linux-gnueabihf'
[100%] Built target test_cadscore.py_run