Raspbian Package Auto-Building

Buildd status for python-skbio (bookworm-staging)

Debian PTSTrackerChangelogBugspackages.d.obuildd.d.o

Package(s): Suite:
Compact mode Co-maintainers

ArchitectureVersionStatusForBuilddStateMiscLogs
Buildd exposure stats armhf  0.5.6-5Build-Attempted4d 17h 12mmb-lxc-02uncompiledmisc:optionalold | all (1)

Tail of log for python-skbio on armhf:

FAILED skbio/stats/distance/tests/test_mantel.py::PairwiseMantelTests::test_many_filepaths_as_input
FAILED skbio/stats/distance/tests/test_mantel.py::PairwiseMantelTests::test_minimal_compatible_input
FAILED skbio/stats/distance/tests/test_mantel.py::PairwiseMantelTests::test_minimal_compatible_input_with_labels
FAILED skbio/stats/distance/tests/test_mantel.py::PairwiseMantelTests::test_na_p_value
FAILED skbio/stats/distance/tests/test_mantel.py::PairwiseMantelTests::test_reordered_distance_matrices
FAILED skbio/stats/distance/tests/test_mantel.py::PairwiseMantelTests::test_strict
FAILED skbio/stats/tests/test_subsample.py::SubsampleCountsTests::test_subsample_counts_nonrandom
FAILED skbio/stats/tests/test_subsample.py::SubsampleCountsTests::test_subsample_counts_without_replacement
FAILED skbio/stats/tests/test_subsample.py::ISubsampleTests::test_isubsample_simple
FAILED skbio/stats/tests/test_subsample.py::ISubsampleTests::test_per_sample_sequences_complex
FAILED skbio/stats/tests/test_subsample.py::ISubsampleTests::test_per_sample_sequences_min_seqs
=== 87 failed, 2231 passed, 30 skipped, 17085 warnings in 243.15s (0:04:03) ====
E: pybuild pybuild:353: test: plugin distutils failed with: exit code=1: cd /<<PKGBUILDDIR>>/.pybuild/cpython3_3.9_skbio/build; python3.9 -m pytest 
dh_auto_test: error: pybuild --test --test-pytest -i python{version} -p 3.9 returned exit code 13
make: *** [debian/rules:13: binary-arch] Error 25