Raspbian Package Auto-Building

Buildd status for pymupdf (bookworm-staging)

Debian PTSTrackerChangelogBugspackages.d.obuildd.d.o

Package(s): Suite:
Compact mode Co-maintainers

ArchitectureVersionStatusForBuilddStateMiscLogs
Buildd exposure stats armhf  1.19.2+ds1-1Build-Attempted56d 23h 43mmb-lxc-02out-of-datemisc:extraold | all (2)

Tail of log for pymupdf on armhf:

    __import__(name)
  File "/<<BUILDDIR>>/pymupdf-1.19.2+ds1/.pybuild/cpython3_3.9/build/fitz/__init__.py", line 10, in <module>
    import fitz.fitz as fitz
  File "/<<BUILDDIR>>/pymupdf-1.19.2+ds1/.pybuild/cpython3_3.9/build/fitz/fitz.py", line 17, in <module>
    from . import _fitz
ImportError: /<<BUILDDIR>>/pymupdf-1.19.2+ds1/.pybuild/cpython3_3.9/build/fitz/_fitz.cpython-39-arm-linux-gnueabihf.so: undefined symbol: jpeg_resync_to_restart


----------------------------------------------------------------------
Ran 1 test in 0.001s

FAILED (errors=1)
E: pybuild pybuild:354: test: plugin distutils failed with: exit code=1: cd /<<BUILDDIR>>/pymupdf-1.19.2+ds1/.pybuild/cpython3_3.9/build; python3.9 -m unittest discover -v 
dh_auto_test: error: pybuild --test -i python{version} -p 3.9 returned exit code 13
make: *** [debian/rules:11: binary-arch] Error 25