Raspbian Package Auto-Building

Buildd status for pyfftw (bullseye-staging)

Debian PTSTrackerChangelogBugspackages.d.obuildd.d.o

Package(s): Suite:
Compact mode Co-maintainers

ArchitectureVersionStatusForBuilddStateMiscLogs
Buildd exposure stats armhf  0.12.0-1Build-Attempted21hbm-wb-02uncompiledmisc:extraold | all (11)

Tail of log for pyfftw on armhf:

One run: 32.30 ms (versus 64.96 ms for singled threaded)
One run: 31.93 ms (versus 64.74 ms for singled threaded)
One run: 70.72 ms (versus 89.42 ms for numpy.fft)
One run: 70.77 ms (versus 89.48 ms for numpy.fft)
One run: 28.37 ms (versus 114.13 ms for numpy.fft)
One run: 28.34 ms (versus 114.12 ms for numpy.fft)
One run: 70.88 ms (versus 67.02 ms for numpy.fft)
One run: 70.47 ms (versus 67.04 ms for numpy.fft)
One run: 35.61 ms (versus 82.03 ms for numpy.fft)
One run: 35.79 ms (versus 84.06 ms for numpy.fft)
E: pybuild pybuild:353: test: plugin distutils failed with: exit code=1: cd /<<PKGBUILDDIR>>/.pybuild/cpython3_3.9_pyfftw/build; python3.9 -m unittest discover -v 
dh_auto_test: error: pybuild --test -i python{version} -p 3.9 returned exit code 13
make[1]: *** [debian/rules:35: override_dh_auto_test] Error 1
make[1]: Leaving directory '/<<PKGBUILDDIR>>'
make: *** [debian/rules:14: build-arch] Error 2