Raspbian Package Auto-Building

Buildd status for pyfftw (bookworm-staging)

Debian PTSTrackerChangelogBugspackages.d.obuildd.d.o

Package(s): Suite:
Compact mode Co-maintainers

ArchitectureVersionStatusForBuilddStateMiscLogs
Buildd exposure stats armhf  0.12.0-1Build-Attempted30d 4h 22mtestbuildduncompiledmisc:extraold | all (3)

Tail of log for pyfftw on armhf:

One run: 19.45 ms (versus 65.04 ms for singled threaded)
One run: 21.40 ms (versus 65.08 ms for singled threaded)
One run: 70.39 ms (versus 84.17 ms for numpy.fft)
One run: 70.37 ms (versus 84.17 ms for numpy.fft)
One run: 28.73 ms (versus 106.02 ms for numpy.fft)
One run: 28.49 ms (versus 106.02 ms for numpy.fft)
One run: 70.64 ms (versus 61.80 ms for numpy.fft)
One run: 70.38 ms (versus 61.79 ms for numpy.fft)
One run: 36.15 ms (versus 78.76 ms for numpy.fft)
One run: 36.01 ms (versus 78.73 ms for numpy.fft)
E: pybuild pybuild:353: test: plugin distutils failed with: exit code=1: cd /<<PKGBUILDDIR>>/.pybuild/cpython3_3.9_pyfftw/build; python3.9 -m unittest discover -v 
dh_auto_test: error: pybuild --test -i python{version} -p 3.9 returned exit code 13
make[1]: *** [debian/rules:35: override_dh_auto_test] Error 1
make[1]: Leaving directory '/<<PKGBUILDDIR>>'
make: *** [debian/rules:14: build-arch] Error 2