Raspbian Package Auto-Building

Buildd status for pulseview, dictd, sssd, traildb, tulip, siconos (bullseye-staging)

Bugs

Package(s): Suite:
Compact mode Co-maintainers

Package armhf
Buildd exposure stats
✔ pulseviewInstalled
✔ dictdInstalled
✔ sssdInstalled
✔ traildbBuild-Attempted
✔ tulipBuild-Attempted
✔ siconosBuild-Attempted

Tail of log for traildb on armhf:

#define HAVE_INTTYPES_H 1
#define HAVE_STDINT_H 1
#define HAVE_UNISTD_H 1
#define HAVE_DLFCN_H 1
#define LT_OBJDIR ".libs/"
#define DSFMT_MEXP 521
#define HAVE_SSE2 1
#define HAVE_LIBJUDY 1
#define HAVE_JUDY_H 1
#define HAVE_ARCHIVE_H 1
#define HAVE_LIBARCHIVE 1

configure: exit 1
dh_auto_configure: error: ./configure --build=arm-linux-gnueabihf --prefix=/usr --includedir=\${prefix}/include --mandir=\${prefix}/share/man --infodir=\${prefix}/share/info --sysconfdir=/etc --localstatedir=/var --disable-option-checking --disable-silent-rules --libdir=\${prefix}/lib/arm-linux-gnueabihf --libexecdir=\${prefix}/lib/arm-linux-gnueabihf --disable-maintainer-mode --disable-dependency-tracking returned exit code 1
make: *** [debian/rules:10: build-arch] Error 25

Tail of log for tulip on armhf:

                 from ../library/tulip-gui/src/GlOffscreenRenderer.cpp:29:
/usr/include/GLES3/gl32.h:1821:187: error: ‘void __glewTexStorage3DMultisample(GLenum, GLsizei, GLenum, GLsizei, GLsizei, GLsizei, GLboolean)’ redeclared as different kind of entity
 1821 | GL_APICALL void GL_APIENTRY glTexStorage3DMultisample (GLenum target, GLsizei samples, GLenum internalformat, GLsizei width, GLsizei height, GLsizei depth, GLboolean fixedsamplelocations);
      |                                                                                                                                                                                           ^
In file included from ../library/tulip-gui/src/GlOffscreenRenderer.cpp:24:
/usr/include/GL/glew.h:20901:50: note: previous declaration ‘void (* __glewTexStorage3DMultisample)(GLenum, GLsizei, GLenum, GLsizei, GLsizei, GLsizei, GLboolean)’
20901 | GLEW_FUN_EXPORT PFNGLTEXSTORAGE3DMULTISAMPLEPROC __glewTexStorage3DMultisample;
      |                                                  ^~~~~~~~~~~~~~~~~~~~~~~~~~~~~
[1172/1775] /usr/bin/c++ -DQT_CORE_LIB -DQT_DLL -DQT_GUI_LIB -DQT_NETWORK_LIB -DQT_NO_DEBUG -DQT_THREAD_SUPPORT -DQT_WIDGETS_LIB -DTULIP_BUILD_PYTHON_COMPONENTS -D_LINUX -Dtulip_gui_5_4_EXPORTS -Ilibrary/tulip-gui/include -Ilibrary/tulip-core/include -I../library/tulip-core/include -I../library/tulip-ogl/include -I../library/tulip-gui/include -Ilibrary/tulip-gui/src -I/usr/include/quazip5 -isystem /usr/include/arm-linux-gnueabihf/qt5 -isystem /usr/include/arm-linux-gnueabihf/qt5/QtWidgets -isystem /usr/include/arm-linux-gnueabihf/qt5/QtGui -isystem /usr/include/arm-linux-gnueabihf/qt5/QtCore -isystem /usr/lib/arm-linux-gnueabihf/qt5/mkspecs/linux-g++ -isystem /usr/include/arm-linux-gnueabihf/qt5/QtNetwork -g -O2 -ffile-prefix-map=/<<BUILDDIR>>/tulip-5.4.0+dfsg=. -fstack-protector-strong -Wformat -Werror=format-security -Wdate-time -D_FORTIFY_SOURCE=2 -Wall -Wextra -Wunused -Wno-long-long -Wold-style-cast -pedantic -Wimplicit-fallthrough=0 -O3 -DNDEBUG -fopenmp -fPIC -fPIC -MD -MT library/tulip-gui/src/CMakeFiles/tulip-gui-5.4.dir/GraphPropertiesSelectionWidget.cpp.o -MF library/tulip-gui/src/CMakeFiles/tulip-gui-5.4.dir/GraphPropertiesSelectionWidget.cpp.o.d -o library/tulip-gui/src/CMakeFiles/tulip-gui-5.4.dir/GraphPropertiesSelectionWidget.cpp.o -c ../library/tulip-gui/src/GraphPropertiesSelectionWidget.cpp
[1173/1775] /usr/bin/c++ -DQT_CORE_LIB -DQT_DLL -DQT_GUI_LIB -DQT_NETWORK_LIB -DQT_NO_DEBUG -DQT_THREAD_SUPPORT -DQT_WIDGETS_LIB -DTULIP_BUILD_PYTHON_COMPONENTS -D_LINUX -Dtulip_gui_5_4_EXPORTS -Ilibrary/tulip-gui/include -Ilibrary/tulip-core/include -I../library/tulip-core/include -I../library/tulip-ogl/include -I../library/tulip-gui/include -Ilibrary/tulip-gui/src -I/usr/include/quazip5 -isystem /usr/include/arm-linux-gnueabihf/qt5 -isystem /usr/include/arm-linux-gnueabihf/qt5/QtWidgets -isystem /usr/include/arm-linux-gnueabihf/qt5/QtGui -isystem /usr/include/arm-linux-gnueabihf/qt5/QtCore -isystem /usr/lib/arm-linux-gnueabihf/qt5/mkspecs/linux-g++ -isystem /usr/include/arm-linux-gnueabihf/qt5/QtNetwork -g -O2 -ffile-prefix-map=/<<BUILDDIR>>/tulip-5.4.0+dfsg=. -fstack-protector-strong -Wformat -Werror=format-security -Wdate-time -D_FORTIFY_SOURCE=2 -Wall -Wextra -Wunused -Wno-long-long -Wold-style-cast -pedantic -Wimplicit-fallthrough=0 -O3 -DNDEBUG -fopenmp -fPIC -fPIC -MD -MT library/tulip-gui/src/CMakeFiles/tulip-gui-5.4.dir/CopyPropertyDialog.cpp.o -MF library/tulip-gui/src/CMakeFiles/tulip-gui-5.4.dir/CopyPropertyDialog.cpp.o.d -o library/tulip-gui/src/CMakeFiles/tulip-gui-5.4.dir/CopyPropertyDialog.cpp.o -c ../library/tulip-gui/src/CopyPropertyDialog.cpp
ninja: build stopped: subcommand failed.
dh_auto_build: error: cd obj-arm-linux-gnueabihf && LC_ALL=C.UTF-8 ninja -j4 -v returned exit code 1
make[1]: *** [debian/rules:14: override_dh_auto_build-arch] Error 25
make[1]: Leaving directory '/<<BUILDDIR>>/tulip-5.4.0+dfsg'
make: *** [debian/rules:8: binary-arch] Error 2

Tail of log for siconos on armhf:

 6518 |     npy_intp this_vector_dim[1] = { v.size() };
      |                                     ~~~~~~^~
/<<BUILDDIR>>/siconos-4.3.1+dfsg/obj-arm-linux-gnueabihf/wrap/siconos/kernelPYTHON_wrap.cxx: In function 'PyObject* SP_SiconosVector_to_numpy(SP::SiconosVector)':
/<<BUILDDIR>>/siconos-4.3.1+dfsg/obj-arm-linux-gnueabihf/wrap/siconos/kernelPYTHON_wrap.cxx:6528:44: warning: narrowing conversion of '((std::__shared_ptr_access<SiconosVector, __gnu_cxx::_S_mutex, false, false>*)(& v))->std::__shared_ptr_access<SiconosVector, __gnu_cxx::_S_mutex, false, false>::operator->()->SiconosVector::size()' from 'unsigned int' to 'npy_intp' {aka 'int'} [-Wnarrowing]
 6528 |     npy_intp this_vector_dim[1] = { v->size() };
      |                                     ~~~~~~~^~
virtual memory exhausted: Cannot allocate memory
make[3]: *** [kernel/swig/CMakeFiles/_kernel.dir/build.make:85: kernel/swig/CMakeFiles/_kernel.dir/__/__/wrap/siconos/kernelPYTHON_wrap.cxx.o] Error 1
make[3]: Leaving directory '/<<BUILDDIR>>/siconos-4.3.1+dfsg/obj-arm-linux-gnueabihf'
make[2]: *** [CMakeFiles/Makefile2:6035: kernel/swig/CMakeFiles/_kernel.dir/all] Error 2
make[2]: Leaving directory '/<<BUILDDIR>>/siconos-4.3.1+dfsg/obj-arm-linux-gnueabihf'
make[1]: *** [Makefile:163: all] Error 2
make[1]: Leaving directory '/<<BUILDDIR>>/siconos-4.3.1+dfsg/obj-arm-linux-gnueabihf'
dh_auto_build: error: cd obj-arm-linux-gnueabihf && make -j1 "INSTALL=install --strip-program=true" VERBOSE=1 returned exit code 2
make: *** [debian/rules:49: binary-arch] Error 25