Raspbian Package Auto-Building

Buildd status for prometheus-libvirt-exporter (bookworm-staging)

Debian PTSTrackerChangelogBugspackages.d.obuildd.d.o

Package(s): Suite:
Compact mode Co-maintainers

ArchitectureVersionStatusForBuilddStateMiscLogs
Buildd exposure stats armhf  0.2.0-1Build-Attempted30d 3h 58mbm-wb-02uncompiledmisc:extraold | all (4)

Tail of log for prometheus-libvirt-exporter on armhf:

text/template
go/doc
gopkg.in/alecthomas/kingpin.v2
github.com/prometheus/common/expfmt
expvar
github.com/prometheus/client_golang/prometheus
github.com/prometheus/client_golang/prometheus/promhttp
# github.com/libvirt/libvirt-go
src/github.com/libvirt/libvirt-go/connect.go:181:77: constant 2147483648 overflows ConnectGetAllDomainStatsFlags
src/github.com/libvirt/libvirt-go/domain_events.go:332:18: type [1073741824]_Ctype_struct__virDomainEventGraphicsSubjectIdentity larger than address space
src/github.com/libvirt/libvirt-go/domain_events.go:332:18: type [1073741824]_Ctype_struct__virDomainEventGraphicsSubjectIdentity too large
dh_auto_build: error: cd build && go install -trimpath -v -p 4 github.com/kumina/libvirt_exporter github.com/kumina/libvirt_exporter/libvirt_schema returned exit code 2
make[1]: *** [debian/rules:19: override_dh_auto_build] Error 25
make[1]: Leaving directory '/<<PKGBUILDDIR>>'
make: *** [debian/rules:12: binary-arch] Error 2