Raspbian Package Auto-Building

Buildd status for postgresql-numeral (bullseye-staging)

Debian PTSTrackerChangelogBugspackages.d.obuildd.d.o

Package(s): Suite:
Compact mode Co-maintainers

ArchitectureVersionStatusForBuilddStateMiscLogs
Buildd exposure stats armhf  1.3-3Build-Attempted9d 22h 42mbm-wb-02uncompiledmisc:extraold | all (5)

Tail of log for postgresql-numeral on armhf:

 
@@ -245,8 +245,8 @@
 (1 row)
 
 SELECT 'zweihundertzweiunddreißig'::zahl;
-           zahl            
----------------------------
+            zahl            
+----------------------------
  zweihundertzweiunddreißig
 (1 row)
 
### End 13 installcheck (FAILED with exit code 1) ###
dh_pgxs_test: error: pg_buildext installcheck . build-%v postgresql-%v-numeral returned exit code 1
make: *** [debian/rules:7: binary-arch] Error 25