Raspbian Package Auto-Building

Buildd status for poedit (bookworm-staging)

Debian PTSTrackerChangelogBugspackages.d.obuildd.d.o

Package(s): Suite:
Compact mode Co-maintainers

ArchitectureVersionStatusForBuilddStateMiscLogs
Buildd exposure stats armhf  3.0-6Build-Attempted29d 10h 5mmb-lxc-02out-of-datetext:sourceold | all (3)

Tail of log for poedit on armhf:

/usr/include/c++/10/bits/stl_algobase.h:511:5: note: parameter passing for argument of type '__gnu_cxx::__normal_iterator<Suggestion*, std::vector<Suggestion> >' changed in GCC 7.1
  511 |     __copy_move_a(_II __first, _II __last, _OI __result)
      |     ^~~~~~~~~~~~~
/usr/include/c++/10/bits/stl_algobase.h:511:5: note: parameter passing for argument of type '__gnu_cxx::__normal_iterator<Suggestion*, std::vector<Suggestion> >' changed in GCC 7.1
/usr/include/c++/10/bits/stl_algobase.h:511:5: note: parameter passing for argument of type '__gnu_cxx::__normal_iterator<Suggestion*, std::vector<Suggestion> >' changed in GCC 7.1
g++ -std=gnu++14  -g -O2 -ffile-prefix-map=/<<PKGBUILDDIR>>=. -fstack-protector-strong -Wformat -Werror=format-security -pthread -I/usr/include -pthread -I/usr/include/libsecret-1 -I/usr/include/libmount -I/usr/include/blkid -I/usr/include/glib-2.0 -I/usr/lib/arm-linux-gnueabihf/glib-2.0/include -I/usr/lib/arm-linux-gnueabihf/wx/include/gtk3-unicode-3.0 -I/usr/include/wx-3.0 -D_FILE_OFFSET_BITS=64 -DWXUSINGDLL -D__WXGTK__ -pthread  -pthread -I/usr/include/gtkspell-3.0 -I/usr/include/enchant-2 -I/usr/include/gtk-3.0 -I/usr/include/at-spi2-atk/2.0 -I/usr/include/at-spi-2.0 -I/usr/include/dbus-1.0 -I/usr/lib/arm-linux-gnueabihf/dbus-1.0/include -I/usr/include/gtk-3.0 -I/usr/include/gio-unix-2.0 -I/usr/include/cairo -I/usr/include/pango-1.0 -I/usr/include/harfbuzz -I/usr/include/pango-1.0 -I/usr/include/fribidi -I/usr/include/harfbuzz -I/usr/include/atk-1.0 -I/usr/include/cairo -I/usr/include/pixman-1 -I/usr/include/uuid -I/usr/include/freetype2 -I/usr/include/libpng16 -I/usr/include/gdk-pixbuf-2.0 -I/usr/include/libpng16 -I/usr/include/arm-linux-gnueabihf -I/usr/include/libmount -I/usr/include/blkid -I/usr/include/glib-2.0 -I/usr/lib/arm-linux-gnueabihf/glib-2.0/include -I/usr/include/lucene++  -DHAVE_PUGIXML -g -Wall -O0 -DwxNO_UNSAFE_WXSTRING_CONV=1 "-DPOEDIT_PREFIX=\"/usr\""  -Wl,--as-needed -Wl,-z,relro -Wl,--as-needed -Wl,-z,relro -o poedit attentionbar.o cat_update.o cat_sorting.o catalog.o catalog_po.o catalog_xliff.o chooselang.o colorscheme.o commentdlg.o concurrency.o configuration.o custom_buttons.o customcontrols.o custom_notebook.o edapp.o edframe.o editing_area.o edlistctrl.o export_html.o extractors/extractor.o extractors/extractor_gettext.o extractors/extractor_legacy.o filemonitor.o fileviewer.o findframe.o gexecute.o hidpi.o icons.o language.o languagectrl.o wx/main_toolbar.o manager.o menus.o pluralforms/pl_evaluate.o prefsdlg.o pretranslate.o progressinfo.o propertiesdlg.o qa_checks.o recent_files.o sidebar.o spellchecking.o syntaxhighlighter.o text_control.o titleless_window.o tm/suggestions.o tm/transmem.o tm/tmx_io.o unicode_helpers.o utility.o welcomescreen.o http_client.o http_client_casablanca.o crowdin_client.o crowdin_gui.o keychain/keytar_posix.o wx_backports/wx_gtk_activityindicator.o wx_backports/wx_gtk_nativewin.o compiled_xrc.o -L/usr/lib/arm-linux-gnueabihf -pthread   -lwx_gtk3u_xrc-3.0 -lwx_baseu_xml-3.0 -lwx_gtk3u_webview-3.0 -lwx_gtk3u_adv-3.0 -lwx_gtk3u_core-3.0 -lwx_baseu_net-3.0 -lwx_baseu-3.0  -llucene++ -lcld2 -lpugixml -lcpprest -lboost_iostreams -lboost_thread -lpthread -lboost_system -lssl -lcrypto -lsecret-1 -lgio-2.0 -lgobject-2.0 -lglib-2.0 -L/usr/lib/arm-linux-gnueabihf -lboost_thread -lpthread -lboost_regex -lboost_system -licui18n -licuuc -licudata -lgtkspell3-3 -lenchant-2 -lgtk-3 -lgdk-3 -lpangocairo-1.0 -lpango-1.0 -lharfbuzz -latk-1.0 -lcairo-gobject -lcairo -lgdk_pixbuf-2.0 -lgio-2.0 -lgobject-2.0 -lglib-2.0
/usr/bin/ld: progressinfo.o: undefined reference to symbol '__atomic_load_8@@LIBATOMIC_1.0'
/usr/bin/ld: /usr/lib/arm-linux-gnueabihf/libatomic.so.1: error adding symbols: DSO missing from command line
collect2: error: ld returned 1 exit status
make[2]: *** [Makefile:658: poedit] Error 1
make[2]: Leaving directory '/<<PKGBUILDDIR>>/src'
make[1]: *** [Makefile:484: all-recursive] Error 1
make[1]: Leaving directory '/<<PKGBUILDDIR>>'
dh_auto_build: error: make -j4 returned exit code 2
make: *** [debian/rules:16: binary-arch] Error 25