Raspbian Package Auto-Building

Buildd status for pmake (bookworm-staging)

Debian PTSTrackerChangelogBugspackages.d.obuildd.d.o

Package(s): Suite:
Compact mode Co-maintainers

ArchitectureVersionStatusForBuilddStateMiscLogs
Buildd exposure stats armhf  20130730-2Build-Attempted30d 17h 41mmb-lxc-02uncompileddevel:sourceold | all (3)

Tail of log for pmake on armhf:

/usr/bin/ld: make_malloc.o:./make.h:454: multiple definition of `debug_file'; arch.o:./make.h:454: first defined here
/usr/bin/ld: parse.o:./make.h:454: multiple definition of `debug_file'; arch.o:./make.h:454: first defined here
/usr/bin/ld: str.o:./make.h:454: multiple definition of `debug_file'; arch.o:./make.h:454: first defined here
/usr/bin/ld: suff.o:./make.h:454: multiple definition of `debug_file'; arch.o:./make.h:454: first defined here
/usr/bin/ld: targ.o:./make.h:454: multiple definition of `debug_file'; arch.o:./make.h:454: first defined here
/usr/bin/ld: trace.o:./make.h:454: multiple definition of `debug_file'; arch.o:./make.h:454: first defined here
/usr/bin/ld: var.o:./make.h:454: multiple definition of `debug_file'; arch.o:./make.h:454: first defined here
/usr/bin/ld: util.o:./make.h:454: multiple definition of `debug_file'; arch.o:./make.h:454: first defined here
/usr/bin/ld: meta.o:./make.h:454: multiple definition of `debug_file'; arch.o:./make.h:454: first defined here
collect2: error: ld returned 1 exit status
make[2]: *** [Makefile.boot:43: bmake] Error 1
make[2]: Leaving directory '/<<PKGBUILDDIR>>'
make[1]: *** [debian/rules:30: override_dh_auto_build] Error 2
make[1]: Leaving directory '/<<PKGBUILDDIR>>'
make: *** [debian/rules:24: build-arch] Error 2