Raspbian Package Auto-Building

Buildd status for passepartout (stretch-staging)

Debian PTSTrackerChangelogBugspackages.d.obuildd.d.o

Package(s): Suite:
Compact mode Co-maintainers

ArchitectureVersionStatusForBuilddStateMiscLogs
Buildd exposure stats armhf  0.7.1-1.1+b3Build-Attempted1397d 7h 17mtestbuilddout-of-dategnome:sourceold | all (2)

BinNMU changelog for passepartout on armhf:

rebuild due to debcheck failure

Tail of log for passepartout on armhf:

compilation terminated.
Makefile:283: recipe for target 'processman.o' failed
make[4]: *** [processman.o] Error 1
make[4]: Leaving directory '/<<PKGBUILDDIR>>/src/util'
Makefile:222: recipe for target 'all-recursive' failed
make[3]: *** [all-recursive] Error 1
make[3]: Leaving directory '/<<PKGBUILDDIR>>/src'
Makefile:165: recipe for target 'all' failed
make[2]: *** [all] Error 2
make[2]: Leaving directory '/<<PKGBUILDDIR>>/src'
Makefile:223: recipe for target 'all-recursive' failed
make[1]: *** [all-recursive] Error 1
make[1]: Leaving directory '/<<PKGBUILDDIR>>'
debian/rules:41: recipe for target 'build-stamp' failed
make: *** [build-stamp] Error 2