Raspbian Package Auto-Building

Buildd status for paraview (bullseye-staging)

Debian PTSTrackerChangelogBugspackages.d.obuildd.d.o

Package(s): Suite:
Compact mode Co-maintainers

ArchitectureVersionStatusForBuilddStateMiscLogs
Buildd exposure stats armhf  5.9.0-2Build-Attempted3h 47mtestwandboarduncompiledscience:sourceold | all (3)

Tail of log for paraview on armhf:

make[4]: Leaving directory '/<<PKGBUILDDIR>>/build.python3.9'
[  7%] Built target CommonCore
[  7%] Linking CXX shared library ../../../../../../../lib/arm-linux-gnueabihf/libvtkm_cont-pv5.9.so
cd /<<PKGBUILDDIR>>/build.python3.9/VTK/ThirdParty/vtkm/vtkvtkm/vtk-m/vtkm/cont && /usr/bin/cmake -E cmake_link_script CMakeFiles/vtkm_cont.dir/link.txt --verbose=1
/usr/bin/c++ -fPIC -g -O2 -ffile-prefix-map=/<<PKGBUILDDIR>>=. -fstack-protector-strong -Wformat -Werror=format-security -Wdate-time -D_FORTIFY_SOURCE=2 -Wdate-time -D_FORTIFY_SOURCE=2  -O3 -DNDEBUG  -Wl,-lc -Wl,-z,relro -Wl,--as-needed  -shared -Wl,-soname,libvtkm_cont-pv5.9.so.1 -o ../../../../../../../lib/arm-linux-gnueabihf/libvtkm_cont-pv5.9.so.1 CMakeFiles/vtkm_cont.dir/ArrayHandle.cxx.o CMakeFiles/vtkm_cont.dir/ArrayHandleBasic.cxx.o CMakeFiles/vtkm_cont.dir/ArrayHandleSOA.cxx.o CMakeFiles/vtkm_cont.dir/BitField.cxx.o CMakeFiles/vtkm_cont.dir/ColorTablePresets.cxx.o CMakeFiles/vtkm_cont.dir/DeviceAdapterTag.cxx.o CMakeFiles/vtkm_cont.dir/EnvironmentTracker.cxx.o CMakeFiles/vtkm_cont.dir/ErrorBadDevice.cxx.o CMakeFiles/vtkm_cont.dir/ErrorBadType.cxx.o CMakeFiles/vtkm_cont.dir/internal/Buffer.cxx.o CMakeFiles/vtkm_cont.dir/internal/DeviceAdapterMemoryManager.cxx.o CMakeFiles/vtkm_cont.dir/internal/DeviceAdapterMemoryManagerShared.cxx.o CMakeFiles/vtkm_cont.dir/internal/TransferInfo.cxx.o CMakeFiles/vtkm_cont.dir/internal/VirtualObjectTransfer.cxx.o CMakeFiles/vtkm_cont.dir/Initialize.cxx.o CMakeFiles/vtkm_cont.dir/Logging.cxx.o CMakeFiles/vtkm_cont.dir/RuntimeDeviceTracker.cxx.o CMakeFiles/vtkm_cont.dir/Token.cxx.o CMakeFiles/vtkm_cont.dir/TryExecute.cxx.o CMakeFiles/vtkm_cont.dir/ArrayRangeCompute.cxx.o CMakeFiles/vtkm_cont.dir/AssignerPartitionedDataSet.cxx.o CMakeFiles/vtkm_cont.dir/BoundsCompute.cxx.o CMakeFiles/vtkm_cont.dir/BoundsGlobalCompute.cxx.o CMakeFiles/vtkm_cont.dir/CellLocator.cxx.o CMakeFiles/vtkm_cont.dir/CellLocatorBoundingIntervalHierarchy.cxx.o CMakeFiles/vtkm_cont.dir/CellLocatorGeneral.cxx.o CMakeFiles/vtkm_cont.dir/CellLocatorRectilinearGrid.cxx.o CMakeFiles/vtkm_cont.dir/CellLocatorTwoLevel.cxx.o CMakeFiles/vtkm_cont.dir/CellLocatorUniformGrid.cxx.o CMakeFiles/vtkm_cont.dir/CellSet.cxx.o CMakeFiles/vtkm_cont.dir/CellSetExplicit.cxx.o CMakeFiles/vtkm_cont.dir/CellSetExtrude.cxx.o CMakeFiles/vtkm_cont.dir/CellSetStructured.cxx.o CMakeFiles/vtkm_cont.dir/ColorTable.cxx.o CMakeFiles/vtkm_cont.dir/CoordinateSystem.cxx.o CMakeFiles/vtkm_cont.dir/DataSet.cxx.o CMakeFiles/vtkm_cont.dir/DataSetBuilderExplicit.cxx.o CMakeFiles/vtkm_cont.dir/DataSetBuilderRectilinear.cxx.o CMakeFiles/vtkm_cont.dir/DataSetBuilderUniform.cxx.o CMakeFiles/vtkm_cont.dir/Field.cxx.o CMakeFiles/vtkm_cont.dir/FieldRangeCompute.cxx.o CMakeFiles/vtkm_cont.dir/FieldRangeGlobalCompute.cxx.o CMakeFiles/vtkm_cont.dir/PartitionedDataSet.cxx.o CMakeFiles/vtkm_cont.dir/PointLocator.cxx.o CMakeFiles/vtkm_cont.dir/PointLocatorSparseGrid.cxx.o CMakeFiles/vtkm_cont.dir/RuntimeDeviceInformation.cxx.o CMakeFiles/vtkm_cont.dir/Timer.cxx.o CMakeFiles/vtkm_cont.dir/UnknownArrayHandle.cxx.o CMakeFiles/vtkm_cont.dir/ArrayHandleVirtual.cxx.o CMakeFiles/vtkm_cont.dir/StorageVirtual.cxx.o CMakeFiles/vtkm_cont.dir/serial/internal/DeviceAdapterAlgorithmSerial.cxx.o CMakeFiles/vtkm_cont.dir/serial/internal/DeviceAdapterRuntimeDetectorSerial.cxx.o CMakeFiles/vtkm_cont.dir/tbb/internal/DeviceAdapterRuntimeDetectorTBB.cxx.o CMakeFiles/vtkm_cont.dir/openmp/internal/DeviceAdapterRuntimeDetectorOpenMP.cxx.o CMakeFiles/vtkm_cont.dir/cuda/internal/DeviceAdapterRuntimeDetectorCuda.cxx.o CMakeFiles/vtkm_cont.dir/kokkos/internal/DeviceAdapterRuntimeDetectorKokkos.cxx.o  -Wl,-rpath,/<<PKGBUILDDIR>>/build.python3.9/lib/arm-linux-gnueabihf: ../../../../../../../lib/arm-linux-gnueabihf/libvtkmdiympi_nompi.so -pthread -ldl 
cd /<<PKGBUILDDIR>>/build.python3.9/VTK/ThirdParty/vtkm/vtkvtkm/vtk-m/vtkm/cont && /usr/bin/cmake -E cmake_symlink_library ../../../../../../../lib/arm-linux-gnueabihf/libvtkm_cont-pv5.9.so.1 ../../../../../../../lib/arm-linux-gnueabihf/libvtkm_cont-pv5.9.so.1 ../../../../../../../lib/arm-linux-gnueabihf/libvtkm_cont-pv5.9.so
make[4]: Leaving directory '/<<PKGBUILDDIR>>/build.python3.9'
[  7%] Built target vtkm_cont
make[3]: Leaving directory '/<<PKGBUILDDIR>>/build.python3.9'
make[2]: *** [Makefile:163: all] Error 2
make[2]: Leaving directory '/<<PKGBUILDDIR>>/build.python3.9'
dh_auto_build: error: cd build.python3.9 && make -j4 "INSTALL=install --strip-program=true" VERBOSE=1 returned exit code 2
make[1]: *** [debian/rules:95: my_build_python3.9] Error 25
make[1]: Leaving directory '/<<PKGBUILDDIR>>'
make: *** [debian/rules:8: build-arch] Error 2