Raspbian Package Auto-Building

Buildd status for paraview (bookworm-staging)

Debian PTSTrackerChangelogBugspackages.d.obuildd.d.o

Package(s): Suite:
Compact mode Co-maintainers

ArchitectureVersionStatusForBuilddStateMiscLogs
Buildd exposure stats armhf  5.9.0-2Build-Attempted29d 9h 8mmb-lxc-02uncompiledscience:sourceold | all (3)

Tail of log for paraview on armhf:

make[4]: Leaving directory '/<<PKGBUILDDIR>>/build.python3.9'
[  9%] Built target ioss
[  9%] Linking CXX shared library ../../../../../../../lib/arm-linux-gnueabihf/libvtkm_worklet-pv5.9.so
cd /<<PKGBUILDDIR>>/build.python3.9/VTK/ThirdParty/vtkm/vtkvtkm/vtk-m/vtkm/worklet && /usr/bin/cmake -E cmake_link_script CMakeFiles/vtkm_worklet.dir/link.txt --verbose=1
/usr/bin/c++ -fPIC -g -O2 -ffile-prefix-map=/<<PKGBUILDDIR>>=. -fstack-protector-strong -Wformat -Werror=format-security -Wdate-time -D_FORTIFY_SOURCE=2 -Wdate-time -D_FORTIFY_SOURCE=2  -O3 -DNDEBUG  -Wl,-lc -Wl,-z,relro -Wl,--as-needed  -shared -Wl,-soname,libvtkm_worklet-pv5.9.so.1 -o ../../../../../../../lib/arm-linux-gnueabihf/libvtkm_worklet-pv5.9.so.1 CMakeFiles/vtkm_worklet.dir/KeysUnsignedTypes.cxx.o CMakeFiles/vtkm_worklet.dir/KeysSignedTypes.cxx.o CMakeFiles/vtkm_worklet.dir/MaskSelect.cxx.o CMakeFiles/vtkm_worklet.dir/ScatterCounting.cxx.o  -Wl,-rpath,/<<PKGBUILDDIR>>/build.python3.9/lib/arm-linux-gnueabihf: ../../../../../../../lib/arm-linux-gnueabihf/libvtkm_cont-pv5.9.so.1 -pthread ../../../../../../../lib/arm-linux-gnueabihf/libvtkmdiympi_nompi.so 
cd /<<PKGBUILDDIR>>/build.python3.9/VTK/ThirdParty/vtkm/vtkvtkm/vtk-m/vtkm/worklet && /usr/bin/cmake -E cmake_symlink_library ../../../../../../../lib/arm-linux-gnueabihf/libvtkm_worklet-pv5.9.so.1 ../../../../../../../lib/arm-linux-gnueabihf/libvtkm_worklet-pv5.9.so.1 ../../../../../../../lib/arm-linux-gnueabihf/libvtkm_worklet-pv5.9.so
make[4]: Leaving directory '/<<PKGBUILDDIR>>/build.python3.9'
[  9%] Built target vtkm_worklet
make[3]: Leaving directory '/<<PKGBUILDDIR>>/build.python3.9'
make[2]: *** [Makefile:163: all] Error 2
make[2]: Leaving directory '/<<PKGBUILDDIR>>/build.python3.9'
dh_auto_build: error: cd build.python3.9 && make -j4 "INSTALL=install --strip-program=true" VERBOSE=1 returned exit code 2
make[1]: *** [debian/rules:95: my_build_python3.9] Error 25
make[1]: Leaving directory '/<<PKGBUILDDIR>>'
make: *** [debian/rules:8: build-arch] Error 2