Raspbian Package Auto-Building

Buildd status for paco (bookworm-staging)

Debian PTSTrackerChangelogBugspackages.d.obuildd.d.o

Package(s): Suite:
Compact mode Co-maintainers

ArchitectureVersionStatusForBuilddStateMiscLogs
Buildd exposure stats armhf  2.0.9-3Build-Attempted29d 12h 36mtestwandboarduncompiledadmin:sourceold | all (3)

Tail of log for paco on armhf:

      |                   ^~~~~~
/usr/include/glibmm-2.4/glibmm/refptr.h:95:10: warning: inline function 'Glib::RefPtr<T_CppObject>::~RefPtr() [with T_CppObject = Glib::ByteArray]' used but never defined
   95 |   inline ~RefPtr() noexcept;
      |          ^
/usr/include/glibmm-2.4/glibmm/refptr.h:104:10: warning: inline function 'Glib::RefPtr<T_CppObject>::RefPtr(const Glib::RefPtr<T_CppObject>&) [with T_CppObject = Glib::ByteArray]' used but never defined
  104 |   inline RefPtr(const RefPtr& src) noexcept;
      |          ^~~~~~
make[3]: *** [Makefile:535: gpaco-main.o] Error 1
make[3]: Leaving directory '/<<PKGBUILDDIR>>/gpaco'
make[2]: *** [Makefile:485: all-recursive] Error 1
make[2]: Leaving directory '/<<PKGBUILDDIR>>'
make[1]: *** [Makefile:396: all] Error 2
make[1]: Leaving directory '/<<PKGBUILDDIR>>'
dh_auto_build: error: make -j1 returned exit code 2
make: *** [debian/rules:21: build-arch] Error 25