Raspbian Package Auto-Building

Buildd status for openimageio (wheezy-staging)

Debian PTSTrackerChangelogBugspackages.d.obuildd.d.o

Package(s): Suite:
Compact mode Co-maintainers

ArchitectureVersionStatusForBuilddStateMiscLogs
Buildd exposure stats armhf  1.0.5+dfsg0-1Build-Attempted1398d 19h 11mbm-wb-02uncompiledlibs:sourceold | all (5)

Tail of log for openimageio on armhf:

/<<BUILDDIR>>/openimageio-1.0.5+dfsg0/src/include/thread.h:336: undefined reference to `__sync_bool_compare_and_swap_8'
CMakeFiles/atomic_test.dir/atomic_test.cpp.o: In function `atomic_exchange_and_add':
/<<BUILDDIR>>/openimageio-1.0.5+dfsg0/src/include/thread.h:286: undefined reference to `__sync_fetch_and_add_8'
/<<BUILDDIR>>/openimageio-1.0.5+dfsg0/src/include/thread.h:286: undefined reference to `__sync_fetch_and_add_8'
collect2: ld returned 1 exit status
make[4]: *** [libOpenImageIO/atomic_test] Error 1
make[4]: Leaving directory `/<<BUILDDIR>>/openimageio-1.0.5+dfsg0/build'
make[3]: *** [libOpenImageIO/CMakeFiles/atomic_test.dir/all] Error 2
make[3]: Leaving directory `/<<BUILDDIR>>/openimageio-1.0.5+dfsg0/build'
make[2]: *** [all] Error 2
make[2]: Leaving directory `/<<BUILDDIR>>/openimageio-1.0.5+dfsg0/build'
dh_auto_build: make -j4 returned exit code 2
make[1]: *** [override_dh_auto_build] Error 2
make[1]: Leaving directory `/<<BUILDDIR>>/openimageio-1.0.5+dfsg0'
make: *** [build-arch] Error 2