Raspbian Package Auto-Building

Buildd status for odc (bullseye-staging)

Debian PTSTrackerChangelogBugspackages.d.obuildd.d.o

Package(s): Suite:
Compact mode Co-maintainers

ArchitectureVersionStatusForBuilddStateMiscLogs
Buildd exposure stats armhf  1.2.0-1Build-Attempted2d 1h 18mmb-lxc-01uncompiledmisc:extraold | all (3)

Tail of log for odc on armhf:

/<<PKGBUILDDIR>>/src/odc/codec/Integer.h:84:41: error: static assertion failed: unsafe casting check
/<<PKGBUILDDIR>>/src/odc/codec/Integer.h: In instantiation of 'void odc::codec::CodecIntegerOffset<ByteOrder, ValueType, InternalValueType, DerivedCodec>::decode(double*) [with ByteOrder = odc::core::OtherByteOrder; ValueType = long long int; InternalValueType = short unsigned int; DerivedCodec = odc::codec::CodecInt16<odc::core::OtherByteOrder, long long int>]':
/<<PKGBUILDDIR>>/src/odc/codec/Integer.h:83:10:   required from here
/<<PKGBUILDDIR>>/src/odc/codec/Integer.h:84:41: error: static assertion failed: unsafe casting check
/<<PKGBUILDDIR>>/src/odc/codec/Integer.h: In instantiation of 'void odc::codec::CodecIntegerOffset<ByteOrder, ValueType, InternalValueType, DerivedCodec>::decode(double*) [with ByteOrder = odc::core::SameByteOrder; ValueType = long long int; InternalValueType = short unsigned int; DerivedCodec = odc::codec::CodecInt16<odc::core::SameByteOrder, long long int>]':
/<<PKGBUILDDIR>>/src/odc/codec/Integer.h:83:10:   required from here
/<<PKGBUILDDIR>>/src/odc/codec/Integer.h:84:41: error: static assertion failed: unsafe casting check
make[3]: *** [src/odc/CMakeFiles/odccore.dir/build.make:631: src/odc/CMakeFiles/odccore.dir/codec/String.cc.o] Error 1
make[3]: Leaving directory '/<<PKGBUILDDIR>>/obj-arm-linux-gnueabihf'
make[2]: *** [CMakeFiles/Makefile2:1319: src/odc/CMakeFiles/odccore.dir/all] Error 2
make[2]: Leaving directory '/<<PKGBUILDDIR>>/obj-arm-linux-gnueabihf'
make[1]: *** [Makefile:185: all] Error 2
make[1]: Leaving directory '/<<PKGBUILDDIR>>/obj-arm-linux-gnueabihf'
dh_auto_build: error: cd obj-arm-linux-gnueabihf && make -j4 "INSTALL=install --strip-program=true" returned exit code 2
make: *** [debian/rules:19: build-arch] Error 25