Debian PTS – Tracker – Changelog – Bugs – packages.d.o – buildd.d.o
Architecture | Version | Status | For | Buildd | State | Misc | Logs |
---|---|---|---|---|---|---|---|
armhf ↓ | 0.12.10+dfsg1-3 | Build-Attempted | 1224d 13h 32m | bm-wb-03 | out-of-date | misc:optional | old | all (8) |
--- PASS: TestCheckSemverConstraint/Prereleases_are_handled_according_to_semver_1 (0.00s) --- PASS: TestCheckSemverConstraint/Prereleases_are_handled_according_to_semver_2 (0.00s) --- PASS: TestCheckSemverConstraint/Meta_is_ignored_according_to_semver (0.00s) --- PASS: TestCheckVersionConstraint (0.04s) PASS ok github.com/hashicorp/nomad/scheduler 24.445s testing: warning: no tests to run PASS ok github.com/hashicorp/nomad/testutil 0.093s [no tests to run] ? github.com/hashicorp/nomad/version [no test files] FAIL dh_auto_test: error: cd _build && go test -vet=off -v -p 3 -short -failfast -timeout 7m -tags "release ui nonvidia" github.com/hashicorp/nomad github.com/hashicorp/nomad/acl github.com/hashicorp/nomad/drivers/exec github.com/hashicorp/nomad/drivers/java github.com/hashicorp/nomad/drivers/mock github.com/hashicorp/nomad/drivers/qemu github.com/hashicorp/nomad/drivers/rawexec github.com/hashicorp/nomad/helper github.com/hashicorp/nomad/helper/args github.com/hashicorp/nomad/helper/boltdd github.com/hashicorp/nomad/helper/codec github.com/hashicorp/nomad/helper/constraints/semver github.com/hashicorp/nomad/helper/discover github.com/hashicorp/nomad/helper/fields github.com/hashicorp/nomad/helper/flag-helpers github.com/hashicorp/nomad/helper/flatmap github.com/hashicorp/nomad/helper/freeport github.com/hashicorp/nomad/helper/gated-writer github.com/hashicorp/nomad/helper/grpc-middleware/logging github.com/hashicorp/nomad/helper/logging github.com/hashicorp/nomad/helper/mount github.com/hashicorp/nomad/helper/noxssrw github.com/hashicorp/nomad/helper/pluginutils/catalog github.com/hashicorp/nomad/helper/pluginutils/grpcutils github.com/hashicorp/nomad/helper/pluginutils/hclspecutils github.com/hashicorp/nomad/helper/pluginutils/hclutils github.com/hashicorp/nomad/helper/pluginutils/loader github.com/hashicorp/nomad/helper/pluginutils/singleton github.com/hashicorp/nomad/helper/pool github.com/hashicorp/nomad/helper/raftutil github.com/hashicorp/nomad/helper/snapshot github.com/hashicorp/nomad/helper/stats github.com/hashicorp/nomad/helper/testlog github.com/hashicorp/nomad/helper/testtask github.com/hashicorp/nomad/helper/tlsutil github.com/hashicorp/nomad/helper/useragent github.com/hashicorp/nomad/helper/uuid github.com/hashicorp/nomad/helper/winsvc github.com/hashicorp/nomad/jobspec github.com/hashicorp/nomad/lib/circbufwriter github.com/hashicorp/nomad/lib/delayheap github.com/hashicorp/nomad/lib/kheap github.com/hashicorp/nomad/nomad github.com/hashicorp/nomad/nomad/drainer github.com/hashicorp/nomad/nomad/mock github.com/hashicorp/nomad/nomad/state github.com/hashicorp/nomad/nomad/structs github.com/hashicorp/nomad/nomad/structs/config github.com/hashicorp/nomad/nomad/types github.com/hashicorp/nomad/nomad/volumewatcher github.com/hashicorp/nomad/plugins github.com/hashicorp/nomad/plugins/base github.com/hashicorp/nomad/plugins/base/proto github.com/hashicorp/nomad/plugins/base/structs github.com/hashicorp/nomad/plugins/csi github.com/hashicorp/nomad/plugins/csi/fake github.com/hashicorp/nomad/plugins/csi/testing github.com/hashicorp/nomad/plugins/device github.com/hashicorp/nomad/plugins/device/cmd/example github.com/hashicorp/nomad/plugins/device/cmd/example/cmd github.com/hashicorp/nomad/plugins/device/proto github.com/hashicorp/nomad/plugins/drivers github.com/hashicorp/nomad/plugins/drivers/proto github.com/hashicorp/nomad/plugins/drivers/testutils github.com/hashicorp/nomad/plugins/drivers/utils github.com/hashicorp/nomad/plugins/shared/cmd/launcher github.com/hashicorp/nomad/plugins/shared/hclspec github.com/hashicorp/nomad/plugins/shared/structs github.com/hashicorp/nomad/plugins/shared/structs/proto github.com/hashicorp/nomad/scheduler github.com/hashicorp/nomad/testutil github.com/hashicorp/nomad/version returned exit code 1 make[1]: *** [debian/rules:59: override_dh_auto_test] Error 25 make[1]: Leaving directory '/<<BUILDDIR>>/nomad-0.12.10+dfsg1' make: *** [debian/rules:29: build-arch] Error 2