Raspbian Package Auto-Building

Buildd status for node-srs (bookworm-staging)

Debian PTSTrackerChangelogBugspackages.d.obuildd.d.o

Package(s): Suite:
Compact mode Co-maintainers

ArchitectureVersionStatusForBuilddStateMiscLogs
Buildd exposure stats armhf  1.2.0+~2.6.2-1Build-Attempted29d 1h 35mbm-wb-02uncompiledjavascript:sourceold | all (1)

Tail of log for node-srs on armhf:

make[1]: *** [gdal.target.mk:154: Release/obj.target/gdal/src/node_gdal.o] Error 1
make[1]: Leaving directory '/<<BUILDDIR>>/node-srs-1.2.0+~2.6.2/gdal/build'
gyp ERR! build error 
gyp ERR! stack Error: `make` failed with exit code: 2
gyp ERR! stack     at ChildProcess.onExit (/usr/share/nodejs/node-gyp/lib/build.js:194:23)
gyp ERR! stack     at ChildProcess.emit (events.js:314:20)
gyp ERR! stack     at Process.ChildProcess._handle.onexit (internal/child_process.js:276:12)
gyp ERR! System Linux 4.9.0-0.bpo.6-armmp
gyp ERR! command "/usr/bin/node" "/usr/bin/node-gyp" "rebuild" "-module_name=gdal" "-module_path=lib/binding/" "-shared_gdal=1"
gyp ERR! cwd /<<BUILDDIR>>/node-srs-1.2.0+~2.6.2/gdal
gyp ERR! node -v v12.22.5
gyp ERR! node-gyp -v v7.1.2
gyp ERR! not ok 
dh_auto_build: error: cd ./gdal && sh -ex ../debian/nodejs/gdal/build returned exit code 1
make: *** [debian/rules:10: binary-arch] Error 25