Raspbian Package Auto-Building

Buildd status for nncp (bookworm-staging)

Debian PTSTrackerChangelogBugspackages.d.obuildd.d.o

Package(s): Suite:
Compact mode Co-maintainers

ArchitectureVersionStatusForBuilddStateMiscLogs
Buildd exposure stats armhf  7.7.0-4Build-Attempted28d 15h 24mtestbuildduncompiledmisc:sourceold | all (1)

Tail of log for nncp on armhf:

?   	go.cypherpunks.ru/nncp/v7/cmd/nncp-hash	[no test files]
?   	go.cypherpunks.ru/nncp/v7/cmd/nncp-log	[no test files]
?   	go.cypherpunks.ru/nncp/v7/cmd/nncp-pkt	[no test files]
?   	go.cypherpunks.ru/nncp/v7/cmd/nncp-reass	[no test files]
?   	go.cypherpunks.ru/nncp/v7/cmd/nncp-rm	[no test files]
?   	go.cypherpunks.ru/nncp/v7/cmd/nncp-stat	[no test files]
?   	go.cypherpunks.ru/nncp/v7/cmd/nncp-toss	[no test files]
?   	go.cypherpunks.ru/nncp/v7/cmd/nncp-trns	[no test files]
?   	go.cypherpunks.ru/nncp/v7/cmd/nncp-xfer	[no test files]
?   	go.cypherpunks.ru/nncp/v7/uilive	[no test files]
FAIL
dh_auto_test: error: cd _build && go test -vet=off -v -p 4 -timeout 1800s go.cypherpunks.ru/nncp/v7 go.cypherpunks.ru/nncp/v7/cmd/nncp-bundle go.cypherpunks.ru/nncp/v7/cmd/nncp-call go.cypherpunks.ru/nncp/v7/cmd/nncp-caller go.cypherpunks.ru/nncp/v7/cmd/nncp-cfgdir go.cypherpunks.ru/nncp/v7/cmd/nncp-cfgenc go.cypherpunks.ru/nncp/v7/cmd/nncp-cfgmin go.cypherpunks.ru/nncp/v7/cmd/nncp-cfgnew go.cypherpunks.ru/nncp/v7/cmd/nncp-check go.cypherpunks.ru/nncp/v7/cmd/nncp-cronexpr go.cypherpunks.ru/nncp/v7/cmd/nncp-daemon go.cypherpunks.ru/nncp/v7/cmd/nncp-exec go.cypherpunks.ru/nncp/v7/cmd/nncp-file go.cypherpunks.ru/nncp/v7/cmd/nncp-freq go.cypherpunks.ru/nncp/v7/cmd/nncp-hash go.cypherpunks.ru/nncp/v7/cmd/nncp-log go.cypherpunks.ru/nncp/v7/cmd/nncp-pkt go.cypherpunks.ru/nncp/v7/cmd/nncp-reass go.cypherpunks.ru/nncp/v7/cmd/nncp-rm go.cypherpunks.ru/nncp/v7/cmd/nncp-stat go.cypherpunks.ru/nncp/v7/cmd/nncp-toss go.cypherpunks.ru/nncp/v7/cmd/nncp-trns go.cypherpunks.ru/nncp/v7/cmd/nncp-xfer go.cypherpunks.ru/nncp/v7/uilive returned exit code 1
make[1]: *** [debian/rules:54: override_dh_auto_test] Error 25
make[1]: Leaving directory '/<<PKGBUILDDIR>>'
make: *** [debian/rules:6: binary-arch] Error 2