Raspbian Package Auto-Building

Buildd status for nipy (wheezy-staging)

Debian PTSTrackerChangelogBugspackages.d.obuildd.d.o

Package(s): Suite:
Compact mode Co-maintainers

ArchitectureVersionStatusForBuilddStateMiscLogs
Buildd exposure stats armhf  0.1.999-2Build-Attempted1401d 7h 52mbm-wb-02uncompiledpython:sourceold | all (5)

Tail of log for nipy on armhf:

           [0, 0, 0, 1]])
Got:
    array([[ 2.,  0.,  0.,  0.],
           [ 0.,  3.,  0.,  0.],
           [ 0.,  0.,  4.,  0.],
           [ 0.,  0.,  0.,  1.]])


----------------------------------------------------------------------
Ran 4834 tests in 3726.642s

FAILED (SKIP=5, failures=2)
make[1]: *** [test] Error 1
make[1]: Leaving directory `/<<PKGBUILDDIR>>'
make: *** [binary-arch] Error 2