Raspbian Package Auto-Building

Buildd status for mlpack (bullseye-staging)

Debian PTSTrackerChangelogBugspackages.d.obuildd.d.o

Package(s): Suite:
Compact mode Co-maintainers

ArchitectureVersionStatusForBuilddStateMiscLogs
Buildd exposure stats armhf  3.4.2-1Build-Attempted13h 27mbm-wb-02uncompiledmisc:sourceold | all (3)

Tail of log for mlpack on armhf:

/usr/bin/clang++ -g -O2 -ffile-prefix-map=/<<PKGBUILDDIR>>=. -fstack-protector-strong -Wformat -Werror=format-security -Wdate-time -D_FORTIFY_SOURCE=2 -Wall -Wextra -ftemplate-depth=1000 -Wno-unused-function -pthread -g -O0 -ftemplate-backtrace-limit=0 -Wno-unknown-pragmas -Wl,-z,relro -Wl,-z,now -rdynamic CMakeFiles/generate_pyx_lsh.dir/__/__/bindings/python/generate_pyx_lsh.cpp.o CMakeFiles/generate_pyx_lsh.dir/__/__/bindings/python/print_pyx.cpp.o -o ../../../../bin/generate_pyx_lsh  -Wl,-rpath,/<<PKGBUILDDIR>>/obj-arm-linux-gnueabihf/lib ../../../../lib/libmlpack.so.3.4 -lm /usr/lib/libarmadillo.so /usr/lib/arm-linux-gnueabihf/libboost_unit_test_framework.so /usr/lib/arm-linux-gnueabihf/libboost_serialization.so 
cd /<<PKGBUILDDIR>>/obj-arm-linux-gnueabihf/src/mlpack/methods/lsh && /usr/bin/cmake -DPROGRAM=/<<PKGBUILDDIR>>/obj-arm-linux-gnueabihf/bin/generate_pyx_lsh -DOUTPUT_FILE=/<<PKGBUILDDIR>>/obj-arm-linux-gnueabihf/src/mlpack/bindings/python/mlpack/lsh.pyx -P /<<PKGBUILDDIR>>/CMake/RunProgram.cmake
make[3]: Leaving directory '/<<PKGBUILDDIR>>/obj-arm-linux-gnueabihf'
[ 56%] Built target generate_pyx_lsh
[ 56%] Linking CXX executable ../../../../bin/generate_pyx_logistic_regression
cd /<<PKGBUILDDIR>>/obj-arm-linux-gnueabihf/src/mlpack/methods/logistic_regression && /usr/bin/cmake -E cmake_link_script CMakeFiles/generate_pyx_logistic_regression.dir/link.txt --verbose=1
/usr/bin/clang++ -g -O2 -ffile-prefix-map=/<<PKGBUILDDIR>>=. -fstack-protector-strong -Wformat -Werror=format-security -Wdate-time -D_FORTIFY_SOURCE=2 -Wall -Wextra -ftemplate-depth=1000 -Wno-unused-function -pthread -g -O0 -ftemplate-backtrace-limit=0 -Wno-unknown-pragmas -Wl,-z,relro -Wl,-z,now -rdynamic CMakeFiles/generate_pyx_logistic_regression.dir/__/__/bindings/python/generate_pyx_logistic_regression.cpp.o CMakeFiles/generate_pyx_logistic_regression.dir/__/__/bindings/python/print_pyx.cpp.o -o ../../../../bin/generate_pyx_logistic_regression  -Wl,-rpath,/<<PKGBUILDDIR>>/obj-arm-linux-gnueabihf/lib ../../../../lib/libmlpack.so.3.4 -lm /usr/lib/libarmadillo.so /usr/lib/arm-linux-gnueabihf/libboost_unit_test_framework.so /usr/lib/arm-linux-gnueabihf/libboost_serialization.so 
cd /<<PKGBUILDDIR>>/obj-arm-linux-gnueabihf/src/mlpack/methods/logistic_regression && /usr/bin/cmake -DPROGRAM=/<<PKGBUILDDIR>>/obj-arm-linux-gnueabihf/bin/generate_pyx_logistic_regression -DOUTPUT_FILE=/<<PKGBUILDDIR>>/obj-arm-linux-gnueabihf/src/mlpack/bindings/python/mlpack/logistic_regression.pyx -P /<<PKGBUILDDIR>>/CMake/RunProgram.cmake
make[3]: Leaving directory '/<<PKGBUILDDIR>>/obj-arm-linux-gnueabihf'
[ 56%] Built target generate_pyx_logistic_regression
make[2]: Leaving directory '/<<PKGBUILDDIR>>/obj-arm-linux-gnueabihf'
make[1]: *** [Makefile:163: all] Error 2
make[1]: Leaving directory '/<<PKGBUILDDIR>>/obj-arm-linux-gnueabihf'
dh_auto_build: error: cd obj-arm-linux-gnueabihf && make -j4 "INSTALL=install --strip-program=true" VERBOSE=1 returned exit code 2
make: *** [debian/rules:59: binary-arch] Error 25