Raspbian Package Auto-Building

Buildd status for mlpack (bookworm-staging)

Debian PTSTrackerChangelogBugspackages.d.obuildd.d.o

Package(s): Suite:
Compact mode Co-maintainers

ArchitectureVersionStatusForBuilddStateMiscLogs
Buildd exposure stats armhf  3.4.2-1Build-Attempted29d 18h 28mtestbuildduncompiledmisc:sourceold | all (3)

Tail of log for mlpack on armhf:

make[3]: Leaving directory '/<<PKGBUILDDIR>>/obj-arm-linux-gnueabihf'
[ 73%] Built target build_pyx_decision_stump
1 warning generated.
clang++ -pthread -shared -Wl,-O1 -Wl,-Bsymbolic-functions -Wl,-z,relro -g -fwrapv -O2 -Wl,-z,relro -Wl,-z,now -g -O2 -ffile-prefix-map=/<<PKGBUILDDIR>>=. -fstack-protector-strong -Wformat -Werror=format-security -Wdate-time -D_FORTIFY_SOURCE=2 build/temp.linux-armv7l-3.9/mlpack/dbscan.o -L/<<PKGBUILDDIR>>/obj-arm-linux-gnueabihf/lib -o build/lib.linux-armv7l-3.9/mlpack/dbscan.cpython-39-arm-linux-gnueabihf.so /<<PKGBUILDDIR>>/obj-arm-linux-gnueabihf/lib/libmlpack.so /usr/lib/arm-linux-gnueabihf/libboost_serialization.so /usr/lib/libarmadillo.so
make[3]: Leaving directory '/<<PKGBUILDDIR>>/obj-arm-linux-gnueabihf'
[ 73%] Built target build_pyx_dbscan
1 warning generated.
clang++ -pthread -shared -Wl,-O1 -Wl,-Bsymbolic-functions -Wl,-z,relro -g -fwrapv -O2 -Wl,-z,relro -Wl,-z,now -g -O2 -ffile-prefix-map=/<<PKGBUILDDIR>>=. -fstack-protector-strong -Wformat -Werror=format-security -Wdate-time -D_FORTIFY_SOURCE=2 build/temp.linux-armv7l-3.9/mlpack/cf.o -L/<<PKGBUILDDIR>>/obj-arm-linux-gnueabihf/lib -o build/lib.linux-armv7l-3.9/mlpack/cf.cpython-39-arm-linux-gnueabihf.so /<<PKGBUILDDIR>>/obj-arm-linux-gnueabihf/lib/libmlpack.so /usr/lib/arm-linux-gnueabihf/libboost_serialization.so /usr/lib/libarmadillo.so
make[3]: Leaving directory '/<<PKGBUILDDIR>>/obj-arm-linux-gnueabihf'
[ 73%] Built target build_pyx_cf
make[2]: Leaving directory '/<<PKGBUILDDIR>>/obj-arm-linux-gnueabihf'
make[1]: *** [Makefile:163: all] Error 2
make[1]: Leaving directory '/<<PKGBUILDDIR>>/obj-arm-linux-gnueabihf'
dh_auto_build: error: cd obj-arm-linux-gnueabihf && make -j4 "INSTALL=install --strip-program=true" VERBOSE=1 returned exit code 2
make: *** [debian/rules:59: binary-arch] Error 25