Raspbian Package Auto-Building

Buildd status for micropython (bookworm-staging)

Debian PTSTrackerChangelogBugspackages.d.obuildd.d.o

Package(s): Suite:
Compact mode Co-maintainers

ArchitectureVersionStatusForBuilddStateMiscLogs
Buildd exposure stats armhf  1.17+ds-1Build-Attempted30d 12h 28mbm-wb-02uncompiledmisc:sourceold | all (2)

Tail of log for micropython on armhf:

pass  import/builtin_import.py
pass  import/gen_context.py
pass  import/gen_context2.py
pass  import/import1a.py
pass  unix/time.py
753 tests performed (20567 individual testcases)
747 tests passed
108 tests skipped: annotate_var async_with async_with2 async_with_break async_with_return btree1 btree_error btree_gc builtin_next_arg2 builtin_range_binop class_inplace_op2 cmd_parsetree del_deref del_local emg_exc exception_chain extra_coverage features ffi_types framebuf1 framebuf16 framebuf2 framebuf4 framebuf8 framebuf_palette framebuf_subclass fun_globals fun_name gen_yield_from_close generator_name heap_locked heapalloc_traceback import_mpy_invalid io_buffered_writer machine_timer math_factorial_intbig memoryview_itemsize namedtuple_asdict opt_level_lineno print_exception repl_words_move resource_stream schedule scope_implicit sys_exc_info sys_getsizeof sys_settrace_features sys_settrace_generator sys_settrace_loop try_finally_return2 try_reraise try_reraise2 uasyncio_await_return uasyncio_basic uasyncio_basic2 uasyncio_cancel_fair uasyncio_cancel_fair2 uasyncio_cancel_self uasyncio_cancel_task uasyncio_cancel_wait_on_finished uasyncio_current_task uasyncio_event uasyncio_event_fair uasyncio_exception uasyncio_fair uasyncio_gather uasyncio_get_event_loop uasyncio_heaplock uasyncio_lock uasyncio_lock_cancel uasyncio_loop_stop uasyncio_micropython uasyncio_new_event_loop uasyncio_set_exception_handler uasyncio_task_done uasyncio_threadsafeflag uasyncio_wait_for uasyncio_wait_for_fwd uasyncio_wait_task ucryptolib_aes128_ctr unboundlocal urandom_extra urandom_extra_float urandom_seed_default ure_debug ure_groups ure_span ure_sub ure_sub_unmatched vfs_basic vfs_blockdev vfs_fat_fileio1 vfs_fat_fileio2 vfs_fat_finaliser vfs_fat_more vfs_fat_mtime vfs_fat_oldproto vfs_fat_ramdisk vfs_fat_ramdisklarge vfs_lfs vfs_lfs_corrupt vfs_lfs_error vfs_lfs_file vfs_lfs_mount vfs_lfs_mtime vfs_lfs_superblock vfs_posix vfs_userfs
6 tests failed: extreme_exc fun_largestate import_pkg3 import_pkg4 import_pkg6 string_format2
make[2]: *** [Makefile:313: test] Error 1
make[2]: Leaving directory '/<<BUILDDIR>>/micropython-1.17+ds/ports/unix'
dh_auto_test: error: cd ports/unix && make -j4 test STRIP=true MICROPY_PY_BTREE=0 MICROPY_SSL_AXTLS=0 MICROPY_SSL_MBEDTLS=1 MICROPY_PY_JNI=1 "TESTS_ARGS=--emit native -e '(?:ussl_basic|urandom_basic|import_pkg7|mpy_native)'" returned exit code 2
make[1]: *** [debian/rules:66: override_dh_auto_test-arch] Error 25
make[1]: Leaving directory '/<<BUILDDIR>>/micropython-1.17+ds'
make: *** [debian/rules:36: binary-arch] Error 2