Raspbian Package Auto-Building

Buildd status for logkeys (wheezy-staging)

Debian PTSTrackerChangelogBugspackages.d.obuildd.d.o

Package(s): Suite:
Compact mode Co-maintainers

ArchitectureVersionStatusForBuilddStateMiscLogs
Buildd exposure stats armhf  0.1.0-1Build-Attempted1401d 3h 13mbm-wb-02uncompiledadmin:sourceold | all (19)

Tail of log for logkeys on armhf:

make[1]: Entering directory `/<<PKGBUILDDIR>>'
/usr/bin/make  all-recursive
make[2]: Entering directory `/<<PKGBUILDDIR>>'
Making all in src
make[3]: Entering directory `/<<PKGBUILDDIR>>/src'
g++ -DHAVE_CONFIG_H -I. -I..   -D_FORTIFY_SOURCE=2  -Wall -O3 -c -o logkeys.o logkeys.cc
logkeys.cc: In function 'int main(int, char**)':
logkeys.cc:473:13: error: 'umask' was not declared in this scope
make[3]: *** [logkeys.o] Error 1
make[3]: Leaving directory `/<<PKGBUILDDIR>>/src'
make[2]: *** [all-recursive] Error 1
make[2]: Leaving directory `/<<PKGBUILDDIR>>'
make[1]: *** [all] Error 2
make[1]: Leaving directory `/<<PKGBUILDDIR>>'
make: *** [debian/stamp-makefile-build] Error 2