Raspbian Package Auto-Building

Buildd status for libzstd (stretch-staging)

Debian PTSTrackerChangelogBugspackages.d.obuildd.d.o

Package(s): Suite:
Compact mode Co-maintainers

ArchitectureVersionStatusForBuilddStateMiscLogs
Buildd exposure stats armhf  1.1.2-1+deb9u1Build-Attempted211d 13h 31mmb-lxc-01out-of-datemisc:sourceold | all (1)

Tail of log for libzstd on armhf:

\nStarting playTests.sh isWindows=false ZSTD=' ../programs/zstd'
\n**** simple tests **** 

test : basic compression 
./playTests.sh: line 49: 22707 Bus error               (core dumped) $ZSTD -f tmp
Makefile:182: recipe for target 'zstd-playTests' failed
make[2]: *** [zstd-playTests] Error 135
make[2]: *** Waiting for unfinished jobs....
make[2]: Leaving directory '/<<PKGBUILDDIR>>/tests'
Makefile:49: recipe for target 'test' failed
make[1]: *** [test] Error 2
make[1]: Leaving directory '/<<PKGBUILDDIR>>'
dh_auto_test: make -j4 test returned exit code 2
debian/rules:12: recipe for target 'build-arch' failed
make: *** [build-arch] Error 2